Triselenothane

Normal alkane RI, non-polar column, temperature ramp

View large format table.

Column type Active phase I Reference Comment
CapillaryDB-11134.2Tsai, Hiserodt, et al., 199860. m/0.32 mm/0.25 μm, He, 40. C @ 2. min, 2. K/min, 280. C @ 30. min

References

Tsai, Hiserodt, et al., 1998
Tsai, J.H.; Hiserodt, R.D.; Ho, C.-T.; Hartman, T.G.; Rosen, R.T., Determination of volatile organic selenium compounds from the Maillard reaction in a selenomethionine - glucose model system, J. Agric. Food Chem., 1998, 46, 7, 2541-2545, https://doi.org/10.1021/jf971050z . [all data]