nickel dihydroxide

Vibrational and/or electronic energy levels

Data compiled by: Marilyn E. Jacox

State:   X

Vib.
sym.
 No.   Approximate
 type of mode
 cm-1   Med.   Method   References

bu 6 OH a-stretch 3712.0 Ar IR Wang and Andrews, 2006
7 NiO2 a-stretch 794.3 Ar IR Park, Hauge, et al., 1988
Wang and Andrews, 2006
8 NiOH bend 520.6 Ar IR Wang and Andrews, 2006

Additional references: Jacox, 1994, page 252

References

Wang and Andrews, 2006
Wang, X.; Andrews, L., Infrared Spectra of M(OH), J. Phys. Chem. A, 2006, 110, 33, 10035, https://doi.org/10.1021/jp0624698 . [all data]

Park, Hauge, et al., 1988
Park, M.; Hauge, R.H.; Margrave, J.L., High Temp. Sci., 1988, 25, 1. [all data]

Jacox, 1994
Jacox, M.E., Vibrational and electronic energy levels of polyatomic transient molecules, American Chemical Society, Washington, DC, 1994, 464. [all data]