4-Phenylbutylammonium nitrate

Phase change data

Data compiled by: Eugene S. Domalski and Elizabeth D. Hearing

Enthalpy of phase transition

ΔHtrs (kJ/mol) Temperature (K) Initial Phase Final Phase Reference Comment
19.100336.crystaline, IIcrystaline, IVan Oort and White, 1989

Entropy of phase transition

ΔStrs (J/mol*K) Temperature (K) Initial Phase Final Phase Reference Comment
6.83336.crystaline, IIcrystaline, IVan Oort and White, 1989

References

Van Oort and White, 1989
Van Oort, M.J.M.; White, M.A., Solid-solid phase transitions in phenalkylammonium salts, Thermochim. Acta, 1989, 139, 205-217. [all data]