4-n-Pentanoyl-4-n'-pentadecanoyloxyazobenzene

Phase change data

Data compiled by: Eugene S. Domalski and Elizabeth D. Hearing

Enthalpy of phase transition

ΔHtrs (kJ/mol) Temperature (K) Initial Phase Final Phase Reference Comment
9.117368.9crystaline, IIcrystaline, IFanelli, Poeti, et al., 1988
42.702374.8crystaline, IliquidFanelli, Poeti, et al., 1988
9.836401.2liquidliquidFanelli, Poeti, et al., 1988

Entropy of phase transition

ΔStrs (J/mol*K) Temperature (K) Initial Phase Final Phase Reference Comment
24.71368.9crystaline, IIcrystaline, IFanelli, Poeti, et al., 1988
113.93374.8crystaline, I, Solidliquid, smectic AFanelli, Poeti, et al., 1988
24.52401.2liquid, Smectic Aliquid, isotropicFanelli, Poeti, et al., 1988

References

Fanelli, Poeti, et al., 1988
Fanelli, E.; Poeti, G.; Francescangeli, O.; Torguati, G., Mesomorphic behaviour of some 4-n-pentanoyl-4'-n-alkanoyloxy azobenzenes (PPAPE). A new series of liquid-crystal compounds, Il Nuovo Cimento, 1988, 10(11), 1373-1384. [all data]