4-n-Pentanoyl-4-n'-hexanoyloxyazobenzene

Phase change data

Data compiled by: Eugene S. Domalski and Elizabeth D. Hearing

Enthalpy of phase transition

ΔHtrs (kJ/mol) Temperature (K) Initial Phase Final Phase Reference Comment
4.665323.8crystaline, IIcrystaline, IFanelli, Poeti, et al., 1988
7.117365.1crystaline, IliquidFanelli, Poeti, et al., 1988
3.360375.2liquidliquidFanelli, Poeti, et al., 1988
9.569377.5liquidliquidFanelli, Poeti, et al., 1988
5.812401.2liquidliquidFanelli, Poeti, et al., 1988

Entropy of phase transition

ΔStrs (J/mol*K) Temperature (K) Initial Phase Final Phase Reference Comment
14.41323.8crystaline, IIcrystaline, IFanelli, Poeti, et al., 1988
19.49365.1crystaline, I, Solidliquid, smectic 3Fanelli, Poeti, et al., 1988
8.954375.2liquid, Smectic 3liquid, smectic 1Fanelli, Poeti, et al., 1988
25.35377.5liquid, Smectic 1liquid, smectic AFanelli, Poeti, et al., 1988
14.49401.2liquid, Smectic Aliquid, isotropicFanelli, Poeti, et al., 1988

References

Fanelli, Poeti, et al., 1988
Fanelli, E.; Poeti, G.; Francescangeli, O.; Torguati, G., Mesomorphic behaviour of some 4-n-pentanoyl-4'-n-alkanoyloxy azobenzenes (PPAPE). A new series of liquid-crystal compounds, Il Nuovo Cimento, 1988, 10(11), 1373-1384. [all data]