3,5-Dimethyl-4-benzyloxyazobenzene

Condensed phase thermochemistry data

Data compiled by: Hussein Y. Afeefy, Joel F. Liebman, and Stephen E. Stein

Quantity Value Units Method Reference Comment
Δfsolid81.2kcal/molCcbCiocazanu, Dogaru, et al., 1988
Quantity Value Units Method Reference Comment
Δcsolid-2739.45kcal/molCcbCiocazanu, Dogaru, et al., 1988

References

Ciocazanu, Dogaru, et al., 1988
Ciocazanu, I.; Dogaru, V.; Moga-Gheorghe, S.; Zavoianu, D., Structure and reactivity of azo ethers. Heats of combustion and formation of some azo ethers, Rev. Chim. (Bucharest), 1988, 39, 227-230. [all data]