Maltol

Kovats' RI, non-polar column, isothermal

View large format table.

Column type Active phase Temperature (C) I Reference Comment
CapillarySE-30100.1092.2Tudor, 199740. m/0.35 mm/0.35 μm
PackedSE-30180.1130.Viani, Müggler-Chavan, et al., 1965He, Chromosorb P; Column length: 6. m

Van Den Dool and Kratz RI, non-polar column, temperature ramp

View large format table.

Column type Active phase I Reference Comment
CapillaryDB-5MS1133.Lozano P.R., Drake M., et al., 200730. m/0.25 mm/0.25 μm, He, 35. C @ 5. min, 10. K/min, 225. C @ 25. min
CapillaryDB-51060.Avsar, Karagul-Yuceer, et al., 200430. m/0.25 mm/0.25 μm, 40. C @ 5. min, 10. K/min, 200. C @ 15. min
CapillaryZB-51114.Bell, 200430. m/0.32 mm/0.50 μm, Helium, 7. K/min, 265. C @ 5. min; Tstart: 40. C
CapillaryDB-51088.Mahajan, Goddik, et al., 200430. m/0.32 mm/1. μm, He, 40. C @ 4. min, 5. K/min, 230. C @ 10. min
CapillaryDB-5MS1088.Karagül-Yüceer, Vlahovich, et al., 200330. m/0.25 mm/0.25 μm, He, 35. C @ 5. min, 10. K/min, 200. C @ 30. min
CapillaryDB-51091.Karagül-Yüceer, Cadwallader, et al., 200230. m/0.32 mm/0.25 μm, 35. C @ 5. min, 10. K/min, 200. C @ 30. min
CapillaryDB-51088.Karagül-Yüceer, Drake, et al., 200130. m/0.32 mm/0.25 μm, 35. C @ 5. min, 10. K/min, 200. C @ 30. min
CapillaryDB-51098.da Silva, Borba, et al., 199930. m/0.25 mm/0.25 μm, H2, 4. K/min; Tstart: 50. C; Tend: 290. C

Van Den Dool and Kratz RI, non-polar column, custom temperature program

View large format table.

Column type Active phase I Reference Comment
CapillaryHP-5MS1110.8Andriamaharavo, 201430. m/0.25 mm/0.25 μm, He; Program: 60C (1 min) => 5 C/min => 210C => 10 C/min => 280C (15 min)
CapillaryHP-51141.Boué, Shih, et al., 200350. m/0.2 mm/0.5 μm, He; Program: 40C(3min) => 10C/min => 60C =3C/min => 150C => 20C/min => 250C (5min)
CapillarySE-541110.Engel, Hoffmann, et al., 200130. m/0.32 mm/0.25 μm; Program: 35C(1min) => 6C/min => 150C => 10C/min => 230C
CapillarySE-541110.Zimmermann and Schieberle, 200030. m/0.25 mm/0.25 μm, He; Program: 35C(2min) => 40C/min => 60C => 6C/min => 180C 20C/min => 240C(10min)
CapillarySE-541110.Fickert and Schieberle, 199825. m/0.32 mm/0.5 μm, He; Program: 35C (2min) => 4C/min => 150C => 10C/min => 240C
CapillaryDB-51110.Beal and Mottram, 199430. m/0.32 mm/1.0 μm, He; Program: 5 0C (0.5 min) -> (1 min) 60 0C (5 min) 4 0C/min -> 250 0C

Van Den Dool and Kratz RI, polar column, temperature ramp

View large format table.

Column type Active phase I Reference Comment
CapillaryDB-Wax1965.Pozo-Bayon M.A., Ruiz-Rodriguez A., et al., 200730. m/0.25 mm/0.5 μm, He, 40. C @ 5. min, 4. K/min, 250. C @ 15. min
CapillaryFFAP1967.Steinhaus and Schieberle, 200730. m/0.32 mm/0.25 μm, 40. C @ 2. min, 6. K/min, 240. C @ 10. min
CapillaryOV-3511961.Bonvehí, 200550. m/0.32 mm/0.2 μm, He, 5. K/min; Tstart: 60. C; Tend: 220. C
CapillaryDB-Wax1991.Avsar, Karagul-Yuceer, et al., 200430. m/0.25 mm/0.25 μm, 40. C @ 5. min, 10. K/min, 200. C @ 15. min
CapillaryDB-Wax1943.Avsar, Karagul-Yuceer, et al., 200430. m/0.25 mm/0.25 μm, 40. C @ 5. min, 10. K/min, 200. C @ 15. min
CapillaryDB-Wax2002.Bell, 200430. m/0.32 mm/0.50 μm, Helium, 7. K/min, 240. C @ 5. min; Tstart: 40. C
CapillaryDB-Wax2012.Mahajan, Goddik, et al., 200430. m/0.25 mm/0.5 μm, He, 40. C @ 2. min, 5. K/min, 230. C @ 10. min
CapillaryDB-FFAP1963.Karagül-Yüceer, Vlahovich, et al., 200330. m/0.25 mm/0.25 μm, He, 35. C @ 5. min, 10. K/min, 200. C @ 30. min
CapillaryDB-FFAP1943.Karagül-Yüceer, Cadwallader, et al., 200230. m/0.25 mm/0.25 μm, 35. C @ 5. min, 10. K/min, 200. C @ 30. min
CapillaryDB-FFAP1949.Karagül-Yüceer, Cadwallader, et al., 200230. m/0.25 mm/0.25 μm, 35. C @ 5. min, 10. K/min, 200. C @ 30. min
CapillaryDB-Wax1996.Wu and Cadwallader, 200230. m/0.32 mm/1. μm, He, 40. C @ 5. min, 10. K/min, 200. C @ 30. min
CapillaryDB-FFAP1953.Zhou, Wintersteen, et al., 200215. m/0.32 mm/0.25 μm, 30. C @ 2. min, 10. K/min, 225. C @ 20. min
CapillaryDB-Wax1978.Karagül-Yüceer, Drake, et al., 200130. m/0.25 mm/0.25 μm, 35. C @ 5. min, 10. K/min, 200. C @ 30. min
CapillarySupelcowax-101969.Chung, 200060. m/0.25 mm/0.25 μm, He, 2. K/min, 195. C @ 90. min; Tstart: 35. C
CapillarySupelcowax-101968.Chung, 199960. m/0.25 mm/0.25 μm, He, 35. C @ 5. min, 2. K/min, 195. C @ 90. min
CapillaryDB-Wax1968.Shiratsuchi, Shimoda, et al., 199360. m/0.25 mm/0.25 μm, 50. C @ 4. min, 2. K/min, 230. C @ 30. min

Van Den Dool and Kratz RI, polar column, custom temperature program

View large format table.

Column type Active phase I Reference Comment
CapillaryStabilwax1975.Natali N., Chinnici F., et al., 200630. m/0.25 mm/0.25 μm, He; Program: 40C => 3C/min => 100C => 5C/min => 240C(10min)
CapillaryFFAP2000.Engel, Hoffmann, et al., 200130. m/0.32 mm/0.25 μm; Program: 35C(1min) => 40C/min => 60C => 6C/min => 230C
CapillaryFFAP1995.Zimmermann and Schieberle, 200030. m/0.25 mm/0.25 μm, He; Program: 35C(2min) => 40C/min => 60C => 6C/min => 180C 20C/min => 240C(10min)
CapillaryFFAP2000.Fickert and Schieberle, 199825. m/0.32 mm/0.5 μm, He; Program: 35C (2min) => 40C/min => 60C => 6C/min => 230C (10min)

Normal alkane RI, non-polar column, temperature ramp

View large format table.

Column type Active phase I Reference Comment
CapillaryHP-5 MS1119.Jerkovic and Marijanovic, 201030. m/0.25 mm/0.25 μm, Helium, 70. C @ 2. min, 3. K/min, 200. C @ 18. min
CapillaryZB-51122.Harrison and Priest, 200930. m/0.25 mm/0.25 μm, Helium, 40. C @ 1. min, 6. K/min, 280. C @ 9. min
CapillarySLB-5MS1139.Risticevic, Carasek, et al., 200810. m/0.18 mm/0.18 μm, Helium, 40. C @ 1.5 min, 10. K/min; Tend: 295. C
CapillaryElite-5MS1109.Tava, Pecetti, et al., 200730. m/0.32 mm/0.5 μm, He, 40. C @ 5. min, 4. K/min, 280. C @ 10. min
CapillaryDB-51110.Fadel, Mageed, et al., 2006He, 50. C @ 5. min, 4. K/min; Column length: 60. m; Column diameter: 0.32 mm; Tend: 250. C
CapillaryHP-5MS1118.Kim, Abd El-Aty, et al., 200630. m/0.25 mm/0.25 μm, He, 50. C @ 4. min, 5. K/min, 280. C @ 10. min
CapillaryDB-5 MS1106.Schirack, Drake, et al., 200630. m/0.25 mm/0.25 μm, 40. C @ 3. min, 8. K/min, 200. C @ 20. min
CapillaryOV-1011070.Friedrich, Acree, et al., 20016. K/min; Column length: 15. m; Column diameter: 0.32 mm; Tstart: 35. C; Tend: 250. C
CapillaryHP-51112.Boylston and Viniyard, 199850. m/0.32 mm/0.52 μm, 35. C @ 15. min, 2. K/min, 250. C @ 45. min
CapillaryHP-11104.Ong, Acree, et al., 19984. K/min; Column length: 25. m; Column diameter: 0.32 mm; Tstart: 35. C; Tend: 250. C
CapillaryDB-11085.Tai and Ho, 199860. m/0.32 mm/1.0 μm, He, 2. K/min; Tstart: 40. C; Tend: 280. C
CapillaryDB-11070.Buttery, Ling, et al., 199730. C @ 25. min, 4. K/min, 200. C @ 20. min; Column length: 60. m; Column diameter: 0.25 mm
CapillaryDB-51112.Lee, Macku, et al., 199160. m/0.25 mm/0.25 μm, 40. C @ 5. min, 2. K/min; Tend: 250. C

Normal alkane RI, non-polar column, custom temperature program

View large format table.

Column type Active phase I Reference Comment
CapillarySLB-5 MS1106.Mondello, 201230. m/0.25 mm/0.25 μm, Helium; Program: not specified
CapillarySLB-5 MS1118.Mondello, 201230. m/0.25 mm/0.25 μm, Helium; Program: not specified
CapillaryHP-5 MS1094.Rodrigues, Hanson, et al., 201230. m/0.32 mm/0.25 μm, Helium; Program: 40 0C (1 min) 3 0C/min -> 150 0C (15 min) 5 0C/min -> 250 0C (5 min)
CapillaryHP-5 MS1094.Rodrigues, Hanson, et al., 201230. m/0.32 mm/0.25 μm, Helium; Program: 40 0C (1 min) 3 0C/min -> 150 0C (15 min) 5 0C/min -> 250 0C (5 min)
CapillaryZB-51111.de Simon, Estruelas, et al., 200930. m/0.25 mm/0.25 μm, Helium; Program: 45 0C 3 0C/min -> 230 0C (10 min) 10 0C/min -> 270 0C (21 min)
CapillarySLB-5MS1108.Risticevic, Carasek, et al., 200810. m/0.18 mm/0.18 μm, Helium; Program: not specified
CapillarySE-301105.Vinogradov, 2004Program: not specified
CapillaryCP Sil 5 CB1086.Counet, Callemien, et al., 200250. m/0.32 mm/1.2 μm; Program: 36C => 20C/min => 85C => 1C/min => 145C=3C/min => 250C(30min)
CapillaryCP-Sil 5 CB1060.Gijs, Chevanese, et al., 200250. m/0.32 mm/1.20 μm, Helium; Program: 36 0C 20 0C/min -> 85 0C 1 0C/min -> 145 0C 3 0C/min -> 250 0C (30 min)
CapillaryDB-51139.Mateo, Aguirrezábal, et al., 199750. m/0.32 mm/0.25 μm, He; Program: 40C(10min) => 3C/min => 95C => 10C/min => 270C(10min)
CapillarySE-541111.Schermann and Schieberle, 199730. m/0.32 mm/0.25 μm, He; Program: 35C (2min) => 40C/min => 60C (2min) => 6C/min => 180C => 10C/min => 240C

Normal alkane RI, polar column, temperature ramp

View large format table.

Column type Active phase I Reference Comment
CapillaryHP-FFAP1998.Wanakhachornkrai and Lertsiri, 999925. m/0.32 mm/0.50 μm, Helium, 15. K/min; Tstart: 45. C; Tend: 220. C
CapillaryHP-FFAP2003.Wanakhachornkrai and Lertsiri, 999925. m/0.32 mm/0.50 μm, Helium, 15. K/min; Tstart: 45. C; Tend: 220. C
CapillaryHP-FFAP2004.Wanakhachornkrai and Lertsiri, 999925. m/0.32 mm/0.50 μm, Helium, 15. K/min; Tstart: 45. C; Tend: 220. C
CapillaryDB-Wax1954.Onishi, Inoue, et al., 201160. m/0.25 mm/0.25 μm, Helium, 50. C @ 2. min, 3. K/min, 220. C @ 20. min
CapillaryDB-Wax2004.Moon and Shibamoto, 200960. m/0.25 mm/0.50 μm, Helium, 40. C @ 5. min, 2. K/min, 210. C @ 70. min
CapillaryFFAP2006.Nebesny, Budryn, et al., 200730. m/0.32 mm/0.5 μm, N2, 35. C @ 5. min, 4. K/min, 320. C @ 45. min
CapillaryRTX-Wax1964.Prososki, Etzel, et al., 200730. m/0.25 mm/0.5 μm, He, 40. C @ 5. min, 10. K/min, 220. C @ 10. min
CapillaryDB-Wax1977.Kishimoto, Wanikawa, et al., 200615. m/0.32 mm/0.25 μm, He, 6. K/min, 230. C @ 20. min; Tstart: 40. C
CapillaryDB-Wax1936.Schirack, Drake, et al., 200630. m/0.25 mm/0.25 μm, 40. C @ 3. min, 8. K/min, 200. C @ 20. min
CapillaryDB-Wax1936.Schirack, Drake, et al., 200630. m/0.25 mm/0.25 μm, 40. C @ 3. min, 8. K/min, 200. C @ 20. min
CapillaryTC-Wax1980.Ishikawa, Ito, et al., 200460. m/0.25 mm/0.5 μm, He, 40. C @ 8. min, 3. K/min; Tend: 230. C
CapillaryDB-Wax1981.Yanagimoto, Ochi, et al., 200430. m/0.25 mm/0.25 μm, He, 3. K/min, 180. C @ 40. min; Tstart: 50. C
CapillaryDB-Wax1985.Yanagimoto, Ochi, et al., 200430. m/0.25 mm/0.25 μm, He, 3. K/min, 180. C @ 40. min; Tstart: 50. C
CapillaryDB-Wax1974.Tanaka, Yamauchi, et al., 200330. m/0.25 mm/0.25 μm, 30. C @ 1. min, 4. K/min; Tend: 250. C
CapillaryHP-FFAP2003.Wanakhachornkrai and Lertsiri, 200325. m/0.32 mm/0.5 μm, He, 15. K/min; Tstart: 45. C; Tend: 220. C
CapillaryHP-FFAP2004.Wanakhachornkrai and Lertsiri, 200325. m/0.32 mm/0.5 μm, He, 15. K/min; Tstart: 45. C; Tend: 220. C
CapillaryHP-FFAP1998.Wanakhachornkrai and Lertsiri, 200325. m/0.32 mm/0.5 μm, He, 15. K/min; Tstart: 45. C; Tend: 220. C
CapillaryFFAP1954.Ducruet, Fournier, et al., 200130. m/0.32 mm/0.25 μm, H2, 40. C @ 5. min, 3. K/min; Tend: 240. C
CapillaryDB-Wax1954.Wei, Mura, et al., 200160. m/0.25 mm/0.25 μm, He, 2. K/min; Tstart: 40. C; Tend: 200. C
CapillaryDB-Wax1960.Buttery, Orts, et al., 199930. C @ 4. min, 2. K/min, 170. C @ 60. min; Column length: 60. m; Column diameter: 0.32 mm
CapillaryDB-Wax1980.Kumazawa and Masuda, 199930. m/0.53 mm/1. μm, 5. K/min; Tstart: 40. C; Tend: 210. C
CapillaryDB-Wax1981.Kumazawa and Masuda, 199960. m/0.25 mm/0.25 μm, 5. K/min; Tstart: 40. C; Tend: 210. C
CapillaryDB-Wax1960.Buttery and Ling, 199830. C @ 4. min, 2. K/min, 170. C @ 30. min; Column length: 60. m; Column diameter: 0.25 mm
CapillaryHP-Innowax1954.Ong, Acree, et al., 19984. K/min; Column length: 25. m; Column diameter: 0.32 mm; Tstart: 35. C; Tend: 250. C
CapillaryCarbowax 20M1961.Cutzach, Chatonnet, et al., 199750. m/0.25 mm/0.25 μm, 3. K/min, 230. C @ 30. min; Tstart: 45. C
CapillaryDB-Wax1973.Sekiwa, Kubota, et al., 1997He, 2. K/min; Column length: 60. m; Column diameter: 0.25 mm; Tstart: 60. C; Tend: 180. C

Normal alkane RI, polar column, custom temperature program

View large format table.

Column type Active phase I Reference Comment
CapillaryStabilwax1975.Chinnici, Guerrero, et al., 200930. m/0.25 mm/0.25 μm, Helium; Program: 35 0C 3 0C/min -> 100 0C 5 0C/min -> 240 0C (10 min)
CapillarySupelcowax-101938.de Simon, Estruelas, et al., 200930. m/0.25 mm/0.25 μm, Helium; Program: 45 0C 3 0C/min -> 230 0C (10 min) 10 0C/min -> 270 0C (21 min)
CapillarySOLGel-Wax1947.Shu and Shen, 200830. m/0.53 mm/0.50 μm, Helium; Program: 40 0C 7 0C/min -> 180 0C 10 0C/min -> 240 0C (10 min)
CapillarySOLGel-Wax1965.Shu and Shen, 200830. m/0.53 mm/0.50 μm, Helium; Program: not specified
CapillaryDB-Wax1959.Gonzalez-Rios, Suarez-Quiroz, et al., 200730. m/0.25 mm/0.25 μm, Hydrogen; Program: 44 0C 3 0C/min -> 170 0C 8 0C/min -> 250 0C
CapillaryHP-Innowax1988.Viegas and Bassoli, 200760. m/0.32 mm/0.25 μm, Helium; Program: 40 0C (5 min) 4 0C/min -> 60 0C (5 min) 8 0C/min -> 250 0C (3 min)
CapillaryHP-Innowax1968.Viegas and Bassoli, 200760. m/0.32 mm/0.25 μm, Helium; Program: not specified
CapillaryFFAP1958.Zehentbauer and Grosch, 199825. m/0.32 mm/0.25 μm, He; Program: 35C(2min) => 40C/min => 60C(2min) => 6C/min => 230C
CapillaryFFAP1961.Schermann and Schieberle, 199730. m/0.32 mm/0.25 μm, He; Program: 35C (2min) => 40C/min => 60C (2min) => 6C/min => 180C => 10C/min => 240C
CapillaryFFAP1925.Schieberle and Grosch, 1994He; Column length: 30. m; Column diameter: 0.32 mm; Program: 35C => 40C/min => 60C(2min) => 4C/min => 240C

References

Tudor, 1997
Tudor, E., Temperature dependence of the retention index for perfumery compounds on a SE-30 glass capillary column. I. Linear equations, J. Chromatogr. A, 1997, 779, 1-2, 287-297, https://doi.org/10.1016/S0021-9673(97)00453-6 . [all data]

Viani, Müggler-Chavan, et al., 1965
Viani, R.; Müggler-Chavan, F.; Reymond, D.; Egli, R.H., 196. Sur la composition de l'arôme de café, Helv. Chim. Acta, 1965, 48, 195-196, 1809-1815, https://doi.org/10.1002/hlca.19650480743 . [all data]

Lozano P.R., Drake M., et al., 2007
Lozano P.R.; Drake M.; Benitez D.; Cadwallader K.R., Instrumental and sensory characterization of heat-induced odorants in aseptically packaged soy milk, J. Agric. Food Chem., 2007, 55, 8, 3018-3026, https://doi.org/10.1021/jf0631225 . [all data]

Avsar, Karagul-Yuceer, et al., 2004
Avsar, Y.K.; Karagul-Yuceer, Y.; Drake, M.A.; Singh, T.K.; Yoon, Y.; Cadwallader, K.R., Characterization of nutty flavor in cheddar cheese, J. Dairy Sci., 2004, 87, 7, 1999-2010, https://doi.org/10.3168/jds.S0022-0302(04)70017-X . [all data]

Bell, 2004
Bell, W.A.-M., Examination of Aroma Volatiles Formed from Thermal Processing of Florida Reconstituted Grapefruit Juice. A Thesis presented to the graduate school of the university of Florida in partial fulfillment of the requirements for the degree of master of science, 2004. [all data]

Mahajan, Goddik, et al., 2004
Mahajan, S.S.; Goddik, L.; Qian, M.C., Aroma Compounds in Sweet Whey Powder, J. Dairy Sci., 2004, 87, 12, 4057-4063, https://doi.org/10.3168/jds.S0022-0302(04)73547-X . [all data]

Karagül-Yüceer, Vlahovich, et al., 2003
Karagül-Yüceer, Y.; Vlahovich, K.N.; Drake, M.A.; Cadwallader, K.R., Characteristic aroma components of rennet casein, J. Agric. Food Chem., 2003, 51, 23, 6797-6801, https://doi.org/10.1021/jf0345806 . [all data]

Karagül-Yüceer, Cadwallader, et al., 2002
Karagül-Yüceer, Y.; Cadwallader, K.R.; Drake, M.A., Volatile flavor components of stored nonfat dry milk, J. Agric. Food Chem., 2002, 50, 2, 305-312, https://doi.org/10.1021/jf010648a . [all data]

Karagül-Yüceer, Drake, et al., 2001
Karagül-Yüceer, Y.; Drake, M.; Cadwallader, K.R., Aroma-active components of nonfat dry milk, J. Agric. Food Chem., 2001, 49, 6, 2948-2953, https://doi.org/10.1021/jf0009854 . [all data]

da Silva, Borba, et al., 1999
da Silva, U.F.; Borba, E.L.; Semir, J.; Marsaioli, A.J., A simple solid injection device for the analyses of Bulbophyllum (Orchidaceae) volatiles, Phytochemistry, 1999, 50, 1, 31-34, https://doi.org/10.1016/S0031-9422(98)00459-2 . [all data]

Andriamaharavo, 2014
Andriamaharavo, N.R., Retention Data. NIST Mass Spectrometry Data Center., NIST Mass Spectrometry Data Center, 2014. [all data]

Boué, Shih, et al., 2003
Boué, S.M.; Shih, B.Y.; Carter-Wientjes, C.H.; Cleveland, T.E., Identification of volatile compounds in soybean at various developmental stages using solid phase microextraction, J. Agric. Food Chem., 2003, 51, 17, 4873-4876, https://doi.org/10.1021/jf030051q . [all data]

Engel, Hoffmann, et al., 2001
Engel, W.; Hoffmann, T.; Schieberle, P., Characterization of 3,4-dihydroxy-3-hexen-2,5-dione as the first open-chain caramel-like smelling flavor compound, Eur. Food Res. Technol., 2001, 213, 2, 104-106, https://doi.org/10.1007/s002170100351 . [all data]

Zimmermann and Schieberle, 2000
Zimmermann, M.; Schieberle, P., Important odorants of sweet bell pepper powder (Capsicum annuum cv. annuum): differences between samples of Hungarian and Morrocan origin, Eur. Food Res. Technol., 2000, 211, 3, 175-180, https://doi.org/10.1007/s002170050019 . [all data]

Fickert and Schieberle, 1998
Fickert, B.; Schieberle, P., Identification of the key odorants in barley malt (caramalt) using GC/MS techniques and odour dilution analyses, Nahrung, 1998, 42, 6, 371-375, https://doi.org/10.1002/(SICI)1521-3803(199812)42:06<371::AID-FOOD371>3.0.CO;2-V . [all data]

Beal and Mottram, 1994
Beal, A.D.; Mottram, D.S., Compounds contributing to the characteristic aroma of malted barley, J. Agric. Food Chem., 1994, 42, 12, 2880-2884, https://doi.org/10.1021/jf00048a043 . [all data]

Pozo-Bayon M.A., Ruiz-Rodriguez A., et al., 2007
Pozo-Bayon M.A.; Ruiz-Rodriguez A.; Pernin K.; Cayot N., Influence of eggs on the aroma composition of a sponge cake and on the aroma release in model studies on flavored sponge cakes, J. Agric. Food Chem., 2007, 55, 4, 1418-1426, https://doi.org/10.1021/jf062203y . [all data]

Steinhaus and Schieberle, 2007
Steinhaus, P.; Schieberle, P., Characterization of the key aroma compounds in soy sauce using approaches of molecular sensory science, J. Agric. Food Chem., 2007, 55, 15, 6262-6269, https://doi.org/10.1021/jf0709092 . [all data]

Bonvehí, 2005
Bonvehí, J.S., Investigation of aromatic compounds in roasted cocoa powder, Eur. Food Res. Technol., 2005, 221, 1-2, 19-29, https://doi.org/10.1007/s00217-005-1147-y . [all data]

Wu and Cadwallader, 2002
Wu, Y.-F.G.; Cadwallader, K.R., Characterization of the aroma of a meatlike process flavoring from soybean-based enzyme-hydrolyzed vegetable protein, J. Agric. Food Chem., 2002, 50, 10, 2900-2907, https://doi.org/10.1021/jf0114076 . [all data]

Zhou, Wintersteen, et al., 2002
Zhou, Q.; Wintersteen, C.L.; Cadwallader, K.R., Identification and quantification of aroma-active components that contribute to the distinct malty flavor of buckwheat honey, J. Agric. Food Chem., 2002, 50, 7, 2016-2021, https://doi.org/10.1021/jf011436g . [all data]

Chung, 2000
Chung, H.Y., Volatile flavor components in red fermented soybean (Glycine max) curds, J. Agric. Food Chem., 2000, 48, 5, 1803-1809, https://doi.org/10.1021/jf991272s . [all data]

Chung, 1999
Chung, H.Y., Volatile components in fermented soybean (Glycine max) curds, J. Agric. Food Chem., 1999, 47, 7, 2690-2696, https://doi.org/10.1021/jf981166a . [all data]

Shiratsuchi, Shimoda, et al., 1993
Shiratsuchi, H.; Shimoda, M.; Minegishi, Y.; Osajima, Y., Isolation and identification of volatile flavor compounds in nonfermented coarse-cut sausage. Flavor as a quality factor of nonfermented sausage. 1, J. Agric. Food Chem., 1993, 41, 4, 647-652, https://doi.org/10.1021/jf00028a027 . [all data]

Natali N., Chinnici F., et al., 2006
Natali N.; Chinnici F.; Riponi C., Characterization of volatiles in extracts from oak chips obtained by accelerated solvent extraction (ASE), J. Agric. Food Chem., 2006, 54, 21, 8190-8198, https://doi.org/10.1021/jf0614387 . [all data]

Jerkovic and Marijanovic, 2010
Jerkovic, I.; Marijanovic, Z., Oak (Quercus frainetto Ten.) honeydaw honey - approach to screening of volatile organic composition and antioxidant capacity (DPPH and FRAP assay), Molecules, 2010, 15, 5, 3744-3756, https://doi.org/10.3390/molecules15053744 . [all data]

Harrison and Priest, 2009
Harrison, B.M.; Priest, F.G., Composition of peaks used in the preparation of malt for Scotch Whisky production - influence of geographical source and extraction depth, J. Agric. Food Chem., 2009, 57, 6, 2385-2391, https://doi.org/10.1021/jf803556y . [all data]

Risticevic, Carasek, et al., 2008
Risticevic, S.; Carasek, E.; Pawliszyn, J., Headspace solid-phase microextraction-gas chromatographic-time-of-flight mass spectrometric methodology for geographical origin verification of coffee, Anal. Chim. Acta, 2008, 617, 1-2, 72-84, https://doi.org/10.1016/j.aca.2008.04.009 . [all data]

Tava, Pecetti, et al., 2007
Tava, A.; Pecetti, L.; Ricci, M.; Pagnotta, M.A.; Russi, L., Volatile compounds from leaves and flowers of Bituminaria bituminosa (L.) Stirt. (Fabaceae) from Italy, Flavour Fragr. J., 2007, 22, 5, 363-370, https://doi.org/10.1002/ffj.1806 . [all data]

Fadel, Mageed, et al., 2006
Fadel, H.H.M.; Mageed, M.A.A.; Samad, A.K.M.E.A.; Lotfy, S.N., Cocoa substitute: Evaluation of sensory qualities and flavour stability, Eur. Food Res. Technol., 2006, 223, 1, 125-131, https://doi.org/10.1007/s00217-005-0162-3 . [all data]

Kim, Abd El-Aty, et al., 2006
Kim, M.R.; Abd El-Aty, A.M.; Kim, I.S.; Shim, J.H., Determination of volatile flavor components in danggui cultivars by solvent free injection and hydrodistillation followed by gas chromatographic-mass spectrometric analysis, J. Chromatogr. A, 2006, 1116, 1-2, 259-264, https://doi.org/10.1016/j.chroma.2006.03.060 . [all data]

Schirack, Drake, et al., 2006
Schirack, A.V.; Drake, M.A.; Sander, T.H.; Sandeep, K.P., Characterization of aroma-active compounds in microwave blanched peanuts, J. Food Sci., 2006, 71, 9, c513-c520, https://doi.org/10.1111/j.1750-3841.2006.00173.x . [all data]

Friedrich, Acree, et al., 2001
Friedrich, J.E.; Acree, T.E.; Lavin, E.H., Selecting standards for gas chromatography - olfactometry, Am. Chem. Soc. Symp. Ser., 2001, 782, 148-155. [all data]

Boylston and Viniyard, 1998
Boylston, T.D.; Viniyard, B.T., Isolation of volatile flavor compounds from peanut butter using purge-and-trap technique in Instrumental Methods in Food and Beverage Analysis, D. Wetzel and G. Charalambous, ed(s)., 1998, 225-243. [all data]

Ong, Acree, et al., 1998
Ong, P.K.C.; Acree, T.E.; Lavin, E.H., Characterization of volatiles in rambutan fruit (Nephelium lappaceum L.), J. Agric. Food Chem., 1998, 46, 2, 611-615, https://doi.org/10.1021/jf970665t . [all data]

Tai and Ho, 1998
Tai, C.-Y.; Ho, C.-T., Influence of glutathione oxidation and pH on thermal formation of Maillard-type volatile compounds, J. Agric. Food Chem., 1998, 46, 6, 2260-2265, https://doi.org/10.1021/jf971111t . [all data]

Buttery, Ling, et al., 1997
Buttery, R.G.; Ling, L.C.; Stern, D.J., Studies on popcorn aroma and flavor volatiles, J. Agric. Food Chem., 1997, 45, 3, 837-843, https://doi.org/10.1021/jf9604807 . [all data]

Lee, Macku, et al., 1991
Lee, S.-R.; Macku, C.; Shibamoto, T., Isolation and identification of headspace volatiles formed in heated butter, J. Agric. Food Chem., 1991, 39, 11, 1972-1975, https://doi.org/10.1021/jf00011a017 . [all data]

Mondello, 2012
Mondello, L., HS-SPME-GCxGC-MS analysis of Yerba Mate (Ilex paraguariensis) in Shimadzu GC-GC application compendium of comprehensive 2D GC, Vol. 1-5, Shimadzu Corp., 2012, 1-29. [all data]

Rodrigues, Hanson, et al., 2012
Rodrigues, C.I.I.; Hanson, C.M.; Nogueira, J.M.F., Coffees and industrial blends aroma profile discrimination according to the chromatic value, Coffee Sci, Lavras, 2012, 7, 2, 167-176. [all data]

de Simon, Estruelas, et al., 2009
de Simon, B.F.; Estruelas, E.; Munoz, A.M.; Cadahia, E.; Sanz, M., Volatile compounds in acacia, chestnut, cherry, ash, and oak woods, with a view to their use in cooperage, J. Agric. Food Chem., 2009, 57, 8, 3217-3227, https://doi.org/10.1021/jf803463h . [all data]

Vinogradov, 2004
Vinogradov, B.A., Production, composition, properties and application of essential oils, 2004, retrieved from http://viness.narod.ru. [all data]

Counet, Callemien, et al., 2002
Counet, C.; Callemien, D.; Ouwerx, C.; Collin, S., Use of gas chromatography-olfactometry to identify key odorant compounds in dark chocolate. Comparison of samples before and after conching, J. Agric. Food Chem., 2002, 50, 8, 2385-2391, https://doi.org/10.1021/jf0114177 . [all data]

Gijs, Chevanese, et al., 2002
Gijs, L.; Chevanese, F.; Jerkovic, V.; Collin, S., How low pH can intensify beta-damascenone and dimethyl trisulfide production through beer aging, J. Agric. Food Chem., 2002, 50, 20, 5612-5616, https://doi.org/10.1021/jf020563p . [all data]

Mateo, Aguirrezábal, et al., 1997
Mateo, J.; Aguirrezábal, M.; Domínguez, C.; Zumalacárregui, J.M., Volatile compounds in Spanish paprika, J. Food Comp. Anal., 1997, 10, 3, 225-232, https://doi.org/10.1006/jfca.1997.0535 . [all data]

Schermann and Schieberle, 1997
Schermann, P.; Schieberle, P., Evaluation of key odorants in milk chocolate and cocoa mass by aroma extract dilution analyses, J. Agric. Food Chem., 1997, 45, 3, 867-872, https://doi.org/10.1021/jf960670h . [all data]

Wanakhachornkrai and Lertsiri, 9999
Wanakhachornkrai, P.; Lertsiri, S., Comparison of determination method for volatile compounds in Thai soy sauce, Analytical, Nutritional and Clinical Methods, 9999, 1-11. [all data]

Onishi, Inoue, et al., 2011
Onishi, M.; Inoue, M.; Araki, T.; Iwabuchi, H.; Sagara, Y., Odorant transfer characteristics of white bread during baking, Biosci Biotechnol. Biochem., 2011, 75, 2, 261-267, https://doi.org/10.1271/bbb.100572 . [all data]

Moon and Shibamoto, 2009
Moon, J.-K.; Shibamoto, T., Role of roasting conditions in the profile of volatile flavor chemicals formed from coffee beans, J. Agric. Food Chem., 2009, 57, 13, 5823-5831, https://doi.org/10.1021/jf901136e . [all data]

Nebesny, Budryn, et al., 2007
Nebesny, E.; Budryn, G.; Kula, J.; Majda, T., The effect of roasting method on headspace composition of robusta coffee bean aroma, Eur. Food Res. Technol., 2007, 225, 1, 9-19, https://doi.org/10.1007/s00217-006-0375-0 . [all data]

Prososki, Etzel, et al., 2007
Prososki, R.A.; Etzel, M.R.; Rankin, S.A., Solvent type affects the number, distribution, and relative quantities of volatile compounds found in sweet whey powder, J. Dairy Sci., 2007, 90, 2, 523-531, https://doi.org/10.3168/jds.S0022-0302(07)71535-7 . [all data]

Kishimoto, Wanikawa, et al., 2006
Kishimoto, T.; Wanikawa, A.; Kono, K.; Shibata, K., Comparison of the Odor-Active Compounds in Unhopped Beer and Beers Hopped with Different Hop Varieties, J. Agric. Food Chem., 2006, 54, 23, 8855-8861, https://doi.org/10.1021/jf061342c . [all data]

Ishikawa, Ito, et al., 2004
Ishikawa, M.; Ito, O.; Ishizaki, S.; Kurobayashi, Y.; Fujita, A., Solid-phase aroma concentrate extraction (SPACE ): a new headspace technique for more sensitive analysis of volatiles, Flavour Fragr. J., 2004, 19, 3, 183-187, https://doi.org/10.1002/ffj.1322 . [all data]

Yanagimoto, Ochi, et al., 2004
Yanagimoto, K.; Ochi, H.; Lee, K.-G.; Shibamoto, T., Antioxidative activities of fractions obtained from brewed coffee, J. Agric. Food Chem., 2004, 52, 3, 592-596, https://doi.org/10.1021/jf030317t . [all data]

Tanaka, Yamauchi, et al., 2003
Tanaka, T.; Yamauchi, T.; Katsumata, R.; Kiuchi, K., Comparison of volatile components in commercial Itohiki-Natto by solid phase microextraction and gas chromatography, Nippon Shokuhin Kagaku Kogaku Kaishi, 2003, 50, 6, 278-285, https://doi.org/10.3136/nskkk.50.278 . [all data]

Wanakhachornkrai and Lertsiri, 2003
Wanakhachornkrai, P.; Lertsiri, S., Analytical, nutritional, and clinical methods. Comparison of determination method for volatile compounds in Thai soy sauce, Food Chem., 2003, 83, 4, 619-629, https://doi.org/10.1016/S0308-8146(03)00256-5 . [all data]

Ducruet, Fournier, et al., 2001
Ducruet, V.; Fournier, N.; Saillard, P.; Feigenbaum, A.; Guichard, E., Influence of packaging on the aroma stability of strawberry syrup during shelf life, J. Agric. Food Chem., 2001, 49, 5, 2290-2297, https://doi.org/10.1021/jf0012796 . [all data]

Wei, Mura, et al., 2001
Wei, A.; Mura, K.; Shibamoto, T., Antioxidative activity of volatile chemicals extracted from beer, J. Agric. Food Chem., 2001, 49, 8, 4097-4101, https://doi.org/10.1021/jf010325e . [all data]

Buttery, Orts, et al., 1999
Buttery, R.G.; Orts, W.J.; Takeoka, G.R.; Nam, Y., Volatile flavor components of rice cakes, J. Agric. Food Chem., 1999, 47, 10, 4353-4356, https://doi.org/10.1021/jf990140w . [all data]

Kumazawa and Masuda, 1999
Kumazawa, K.; Masuda, H., Identification of potent odorants in Japanese green tea (Sen-cha), J. Agric. Food Chem., 1999, 47, 12, 5169-5172, https://doi.org/10.1021/jf9906782 . [all data]

Buttery and Ling, 1998
Buttery, R.G.; Ling, L.C., Additional studies on flavor components of corn tortilla chips, J. Agric. Food Chem., 1998, 46, 7, 2764-2769, https://doi.org/10.1021/jf980125b . [all data]

Cutzach, Chatonnet, et al., 1997
Cutzach, I.; Chatonnet, P.; Henry, R.; Dubourdieu, D., Identification of volatile compounds with a Toasty aroma in heated oak used in barrelmaking, J. Agric. Food Chem., 1997, 45, 6, 2217-2224, https://doi.org/10.1021/jf960947d . [all data]

Sekiwa, Kubota, et al., 1997
Sekiwa, Y.; Kubota, K.; Kobayashi, A., Characteristic flavor components in the brew of cooked clam (Meretrix lusoria) and the effect of storage on flavor formation, J. Agric. Food Chem., 1997, 45, 3, 826-830, https://doi.org/10.1021/jf960433e . [all data]

Chinnici, Guerrero, et al., 2009
Chinnici, F.; Guerrero, E.D.; Sonni, F.; Natali, N.; Marin, R.N.; Riponi, C., Gas chromatography - mass spectrometry (GC-MS) characterization of volatile compounds in quality vinegars with protected Europian geographical indication, J. Agric. Food Chem., 2009, 57, 11, 4784-4792, https://doi.org/10.1021/jf804005w . [all data]

Shu and Shen, 2008
Shu, N.; Shen, H., Aroma-impact compounds in Lysimachia foenum-graecum extracts, Flavour Fragr. J., 2008, 24, 1, 1-6, https://doi.org/10.1002/ffj.1908 . [all data]

Gonzalez-Rios, Suarez-Quiroz, et al., 2007
Gonzalez-Rios, O.; Suarez-Quiroz, M.L.; Boulanger, R.; Barel, M.; Guyot, B.; Guiraud, J.-P.; Schorr-Galindo, S., Impact of ecological post-harvest processing of coffee aroma: II Roasted coffee., J. Food Composition Analysis, 2007, 20, 3-4, 297-307, https://doi.org/10.1016/j.jfca.2006.12.004 . [all data]

Viegas and Bassoli, 2007
Viegas, M.C.; Bassoli, D.G., Utilizacao do indice de retencao linear para caracterizacao de compostos volateis em cafe soluvel utilizando GC-MS e coluna HP-Innowax, Quim. Nova, 2007, 30, 8, 2031-2034, https://doi.org/10.1590/S0100-40422007000800040 . [all data]

Zehentbauer and Grosch, 1998
Zehentbauer, G.; Grosch, W., Crust aroma of baguettes. I. Key odorants of baguettes prepared in two different ways, J. Cereal Science, 1998, 28, 1, 81-92, https://doi.org/10.1006/jcrs.1998.0184 . [all data]

Schieberle and Grosch, 1994
Schieberle, P.; Grosch, W., Potent odorants of rye bread crust - differences from the crumb and from wheat bread crust, Z. Lebensm. Unters. Forsch., 1994, 198, 4, 292-296, https://doi.org/10.1007/BF01193177 . [all data]