3,4-Hexanediol, 3,4-dimethyl-

Phase change data

Data compiled by: Thermodynamics Research Center, NIST Boulder Laboratories, Chris Muzny director

Quantity Value Units Method Reference Comment
Tfus326.KN/AReeve and Karickhoff, 1956Uncertainty assigned by TRC = 3. K

In addition to the Thermodynamics Research Center (TRC) data available from this site, much more physical and chemical property data is available from the following TRC products:

References

Reeve and Karickhoff, 1956
Reeve, W.; Karickhoff, M., The Pinacol Rearrangement of meso- and dl-3,4-Dimethyl-hexanediol, J. Am. Chem. Soc., 1956, 78, 6053. [all data]