Tripyridyl

Gas phase thermochemistry data

Data compiled by: Hussein Y. Afeefy, Joel F. Liebman, and Stephen E. Stein

Quantity Value Units Method Reference Comment
Δfgas394.6 ± 4.6kJ/molCcbHussein and Akasheh, 1985

References

Hussein and Akasheh, 1985
Hussein, A.; Akasheh, T.S., Heat of combustion of heterocyclic compounds. Part II., Dirasat - Univ. Jordan, 1985, 12, 65-72. [all data]