Coumarin, 3-thiocyano-4-methyl-7-(N,N-diethylamino)-

Gas phase ion energetics data

Data compiled by: Sharon G. Lias and Joel F. Liebman

Ionization energy determinations

IE (eV) Method Reference Comment
7.75PERedchenko, Safronov, et al., 1992Vertical value

References

Redchenko, Safronov, et al., 1992
Redchenko, V.V.; Safronov, A.I.; Kirpichenok, M.A.; Grandberg, I.I.; Traven', V.F., Electronic structure of π-systems. XV. Photoelectron spectra of 7-aminocoumarin derivatives, J. Gen. Chem. USSR, 1992, 62, 2313. [all data]