5-(3-Dimethylaminopropyl)-10,11-dihydro-5h-dibenz-[b,f]-azepine, hydrochloride

Phase change data

Data compiled by: Thermodynamics Research Center, NIST Boulder Laboratories, Chris Muzny director

Quantity Value Units Method Reference Comment
Tfus445.1KN/AChauvet and Masse, 1983Uncertainty assigned by TRC = 0.5 K

In addition to the Thermodynamics Research Center (TRC) data available from this site, much more physical and chemical property data is available from the following TRC products:

References

Chauvet and Masse, 1983
Chauvet, A.; Masse, J., Thermoanalytical analysis of psychotherapeutic substances: III. antidepressants. imipramine hydrochloride, chlomipra- mine hydrochloride, nortriptyline hydrochloride, amitriptyline hydrochloride., Thermochim. Acta, 1983, 65, 179. [all data]