C4H7NO2S

Gas phase ion energetics data

Data compiled by: John E. Bartmess

De-protonation reactions

C4H6NO2S- + Hydrogen cation = C4H7NO2S

By formula: C4H6NO2S- + H+ = C4H7NO2S

Quantity Value Units Method Reference Comment
Δr1409. ± 10.kJ/molG+TSBouchoux, Jaudon, et al., 1991gas phase
Quantity Value Units Method Reference Comment
Δr1381. ± 9.6kJ/molIMREBouchoux, Jaudon, et al., 1991gas phase

Reaction thermochemistry data

Data compiled by: John E. Bartmess

Individual Reactions

C4H6NO2S- + Hydrogen cation = C4H7NO2S

By formula: C4H6NO2S- + H+ = C4H7NO2S

Quantity Value Units Method Reference Comment
Δr1409. ± 10.kJ/molG+TSBouchoux, Jaudon, et al., 1991gas phase
Quantity Value Units Method Reference Comment
Δr1381. ± 9.6kJ/molIMREBouchoux, Jaudon, et al., 1991gas phase

References

Bouchoux, Jaudon, et al., 1991
Bouchoux, G.; Jaudon, P.; Decouzon, M.; Gal, J.-F.; Maria, P.-C., Gas-Phase Acidity of Some alpha-keto Aldoximes: Experiment and Theory, J. Phys. Org. Chem., 1991, 4, 5, 285, https://doi.org/10.1002/poc.610040505 . [all data]