Cyanic acid, phenyl ester

Condensed phase thermochemistry data

Data compiled by: Hussein Y. Afeefy, Joel F. Liebman, and Stephen E. Stein

Quantity Value Units Method Reference Comment
Δfliquid88.3 ± 0.8kJ/molCcbLebedev, Rabinovich, et al., 1977
Quantity Value Units Method Reference Comment
Δcliquid-3557. ± 0.8kJ/molCcbLebedev, Rabinovich, et al., 1977

References

Lebedev, Rabinovich, et al., 1977
Lebedev, B.V.; Rabinovich, I.B.; Kiparisova, E.G.; Evstropov, A.A.; Korshak, V.V.; Pankratov, V.A.; Larina, L.F., Thermodynamics of the polycyclotrimerization of aromatic dicyanates and diisocyanates, Dokl. Phys. Chem. (Engl. Transl.), 1977, 237, 1081-1084, In original 383. [all data]