N-Methyl-4-pyridinamine

Gas phase ion energetics data

Data compiled as indicated in comments:
LLK - Sharon G. Lias, Rhoda D. Levin, and Sherif A. Kafafi

Ionization energy determinations

IE (eV) Method Reference Comment
8.75 ± 0.05EIGronneberg and Undheim, 1973LLK

References

Gronneberg and Undheim, 1973
Gronneberg, T.; Undheim, K., Mass spectrometry of onium compounds - XV. ionization potentials of amino pyridines, Tetrahedron Lett., 1973, 3193. [all data]