Ethanol, 2-(2-ethoxyethoxy)-, acetate

Phase change data

Data compiled as indicated in comments:
BS - Robert L. Brown and Stephen E. Stein
TRC - Thermodynamics Research Center, NIST Boulder Laboratories, Chris Muzny director
AC - William E. Acree, Jr., James S. Chickos

Quantity Value Units Method Reference Comment
Tboil491.7KN/AWeast and Grasselli, 1989BS
Quantity Value Units Method Reference Comment
Tc663.KN/AWilson, Wilson, et al., 1996Uncertainty assigned by TRC = 3. K; TRC
Quantity Value Units Method Reference Comment
Pc27.30barN/AWilson, Wilson, et al., 1996Uncertainty assigned by TRC = 2.00 bar; TRC

Enthalpy of vaporization

ΔvapH (kJ/mol) Temperature (K) Method Reference Comment
51.7308.AStephenson and Malanowski, 1987Based on data from 293. - 491. K.; AC

In addition to the Thermodynamics Research Center (TRC) data available from this site, much more physical and chemical property data is available from the following TRC products:

References

Weast and Grasselli, 1989
CRC Handbook of Data on Organic Compounds, 2nd Editon, Weast,R.C and Grasselli, J.G., ed(s)., CRC Press, Inc., Boca Raton, FL, 1989, 1. [all data]

Wilson, Wilson, et al., 1996
Wilson, L.C.; Wilson, H.L.; Wilding, W.V.; Wilson, G.M., Critical Point Measurements for Fourteen Compounds by a Static Method and a Flow Method, J. Chem. Eng. Data, 1996, 41, 1252-4. [all data]

Stephenson and Malanowski, 1987
Stephenson, Richard M.; Malanowski, Stanislaw, Handbook of the Thermodynamics of Organic Compounds, 1987, https://doi.org/10.1007/978-94-009-3173-2 . [all data]