3-Cyclobutene-1,2-dione, 3,4-dimethyl-

Gas phase ion energetics data

Data compiled by: Sharon G. Lias, Rhoda D. Levin, and Sherif A. Kafafi

Ionization energy determinations

IE (eV) Method Reference Comment
9.06PESchang, Gleiter, et al., 1978Vertical value
9.10PEGleiter, Schang, et al., 1978Vertical value

References

Schang, Gleiter, et al., 1978
Schang, P.; Gleiter, R.; Rieker, A., The He(I) photoelectron spectrum of cyclobutene-1,2-dione and o-benzoquinone, Ber. Bunsen-Ges. Phys. Chem., 1978, 82, 629. [all data]

Gleiter, Schang, et al., 1978
Gleiter, R.; Schang, P.; Seitz, G., Photoelectron spectra of cyclobutene-1,2-dione derivatives, Chem. Phys. Lett., 1978, 55, 144. [all data]