4,5-Dihydro-3-nitro-isoxazole

Gas phase thermochemistry data

Data compiled by: Hussein Y. Afeefy, Joel F. Liebman, and Stephen E. Stein

Quantity Value Units Method Reference Comment
Δfgas39. ± 2.kJ/molCcbMiroshnichenko and Lebedev, 1969

References

Miroshnichenko and Lebedev, 1969
Miroshnichenko, E.A.; Lebedev, Yu.A., The energy of N-O bond in N-oxide of 3-nitroisoxazoline, Khim. Geterotsikl. Soedin., 1969, 5, 963-964. [all data]