1-Decanamine, N,N-dimethyl-

Kovats' RI, non-polar column, isothermal

View large format table.

Column type Active phase Temperature (C) I Reference Comment
CapillaryApiezon LH + KF100.1292.Samusenko, Svetlova, et al., 198630. m/0.25 mm/0.063 μm, He
CapillaryApiezon LH + KF100.1293.Samusenko, Svetlova, et al., 198630. m/0.25 mm/0.063 μm, He
CapillaryApiezon LH + KF100.1293.Samusenko, Svetlova, et al., 198630. m/0.25 mm/0.063 μm, He
CapillaryApiezon LH + KF100.1293.Samusenko, Svetlova, et al., 198630. m/0.25 mm/0.063 μm, He
CapillaryApiezon LH + KF100.1294.Samusenko, Svetlova, et al., 198630. m/0.25 mm/0.063 μm, He
CapillaryApiezon LH + KF100.1294.Samusenko, Svetlova, et al., 198630. m/0.25 mm/0.063 μm, He
CapillaryApiezon LH + KF100.1294.Samusenko, Svetlova, et al., 198630. m/0.25 mm/0.063 μm, He
CapillaryApiezon L + KF100.1292.Samusenko, Svetlova, et al., 198630. m/0.25 mm/0.063 μm, He
CapillaryApiezon L + KF100.1292.Samusenko, Svetlova, et al., 198630. m/0.25 mm/0.063 μm, He
CapillaryApiezon L + KF100.1292.Samusenko, Svetlova, et al., 198630. m/0.25 mm/0.063 μm, He
CapillaryApiezon L + KF100.1292.Samusenko, Svetlova, et al., 198630. m/0.25 mm/0.063 μm, He
CapillaryApiezon L + KF100.1293.Samusenko, Svetlova, et al., 198630. m/0.25 mm/0.063 μm, He
CapillaryApiezon L + KF100.1294.Samusenko, Svetlova, et al., 198630. m/0.25 mm/0.063 μm, He
CapillaryApiezon L + KF100.1294.Samusenko, Svetlova, et al., 198630. m/0.25 mm/0.063 μm, He
CapillaryApiezon L + KF100.1292.Svetlova, Samusenko, et al., 198630. m/0.25 mm/0.06 μm
CapillaryApiezon L + KF100.1292.Svetlova, Samusenko, et al., 198630. m/0.25 mm/0.06 μm
CapillaryApiezon L + KF100.1292.Svetlova, Samusenko, et al., 198630. m/0.25 mm/0.06 μm
CapillaryApiezon L + KF100.1293.Svetlova, Samusenko, et al., 198630. m/0.25 mm/0.06 μm
CapillaryApiezon L + KF100.1294.Svetlova, Samusenko, et al., 198630. m/0.25 mm/0.06 μm
CapillaryApiezon L + KF100.1294.Svetlova, Samusenko, et al., 198630. m/0.25 mm/0.06 μm

Normal alkane RI, non-polar column, temperature ramp

View large format table.

Column type Active phase I Reference Comment
CapillaryUltra-11298.Okumura, 199125. m/0.32 mm/0.25 μm, He, 3. K/min; Tstart: 80. C; Tend: 260. C

Phase change data

Data compiled as indicated in comments:
TRC - Thermodynamics Research Center, NIST Boulder Laboratories, Chris Muzny director
AC - William E. Acree, Jr., James S. Chickos

Quantity Value Units Method Reference Comment
Tboil507.15KN/AVon Braun, Teuffert, et al., 1929Uncertainty assigned by TRC = 3. K; TRC

Enthalpy of vaporization

ΔvapH (kJ/mol) Temperature (K) Method Reference Comment
55.2420.AStephenson and Malanowski, 1987Based on data from 405. - 564. K.; AC

In addition to the Thermodynamics Research Center (TRC) data available from this site, much more physical and chemical property data is available from the following TRC products:

References

Samusenko, Svetlova, et al., 1986
Samusenko, A.L.; Svetlova, N.I.; Golovnya, R.V., Reproducible and durable glass capillary columns with hydrogenated apiezon-l and OV-101 for the analysis of polar substances, Zh. Anal. Khim., 1986, 61, 1, 127-133. [all data]

Svetlova, Samusenko, et al., 1986
Svetlova, N.I.; Samusenko, A.L.; Golovnya, R.V., Advantage of the universal equation over the linear equation for the calculation of retention parameters of homologous series in capillary chromatography, J. Hi. Res. Chromatogr. Chromatogr. Comm., 1986, 9, 12, 737-740, https://doi.org/10.1002/jhrc.1240091205 . [all data]

Okumura, 1991
Okumura, T., retention indices of environmental chemicals on methyl silicone capillary column, Journal of Environmental Chemistry (Japan), 1991, 1, 2, 333-358, https://doi.org/10.5985/jec.1.333 . [all data]