But-1-enyl-p-tolyl sulphone

Condensed phase thermochemistry data

Data compiled by: Hussein Y. Afeefy, Joel F. Liebman, and Stephen E. Stein

Quantity Value Units Method Reference Comment
Δfsolid-335.8 ± 1.1kJ/molCcrMackle, McNally, et al., 1969Hfusion=2.2±0.4 kcal/mol,Heat of comb. corrected for constant pressure
Quantity Value Units Method Reference Comment
Δcsolid-6595.7 ± 0.2kJ/molCcrMackle, McNally, et al., 1969Hfusion=2.2±0.4 kcal/mol,Heat of comb. corrected for constant pressure

Gas phase thermochemistry data

Data compiled by: Hussein Y. Afeefy, Joel F. Liebman, and Stephen E. Stein

Quantity Value Units Method Reference Comment
Δfgas-54.9 ± 0.8kcal/molCcrMackle, McNally, et al., 1969Hfusion=2.2±0.4 kcal/mol,Heat of comb. corrected for constant pressure

References

Mackle, McNally, et al., 1969
Mackle, H.; McNally, D.V.; Steele, W.V., Studies in the thermochemistry of sulphones. Part 10. Heats of combustion and formation of several αβ-unsaturated sulphones, Trans. Faraday Soc., 1969, 65, 2060-2068. [all data]