Octane, 3-chloro-

Reaction thermochemistry data

Data compiled by: Hussein Y. Afeefy, Joel F. Liebman, and Stephen E. Stein

Individual Reactions

Octane, 2-chloro- = Octane, 3-chloro-

By formula: C8H17Cl = C8H17Cl

Quantity Value Units Method Reference Comment
Δr-0.13kJ/molCisoRoganov, Kabo, et al., 1969liquid phase

References

Roganov, Kabo, et al., 1969
Roganov, G.N.; Kabo, G.Ya.; Adreevskii, D.N., Additivity of thermochemical properties for isomers of secondary n-alkane chlorides (C5-C10), J. Org. Chem. USSR (Engl. Transl.), 1969, 5, 2037-2041. [all data]