2-Butenal, 2-methyl-

Kovats' RI, non-polar column, temperature ramp

View large format table.

Column type Active phase I Reference Comment
CapillaryBP-1730.Bartley and Schwede, 1989He, 30. C @ 2. min, 2. K/min; Column length: 50. m; Column diameter: 0.23 mm; Tend: 200. C

Kovats' RI, polar column, temperature ramp

View large format table.

Column type Active phase I Reference Comment
CapillaryCarbowax 20M1076.Shibamoto, Kamiya, et al., 1981N2, 2. K/min; Column length: 50. m; Column diameter: 0.28 mm; Tstart: 80. C; Tend: 200. C

Van Den Dool and Kratz RI, non-polar column, custom temperature program

View large format table.

Column type Active phase I Reference Comment
CapillaryCP Sil 8 CB749.Oruna-Concha, Bakker, et al., 200260. m/0.25 mm/0.25 μm, He; Program: 0C => rapidly => 40C(8min) => 4C/min => 250C(10min)
CapillaryDB-5749.Parker, Hassell, et al., 200050. m/0.32 mm/0.5 μm, He; Program: oC(5min) => 60C/min => 60C (5min) => 4C/min => 250C

Van Den Dool and Kratz RI, polar column, temperature ramp

View large format table.

Column type Active phase I Reference Comment
CapillaryFFAP1097.Calvo-Gómez, Morales-López, et al., 200430. m/0.25 mm/0.25 μm, He, 40. C @ 3. min, 5. K/min; Tend: 220. C
CapillaryAT-Wax1093.Pino and Marbot, 200160. m/0.32 mm/0.25 μm, He, 65. C @ 10. min, 2. K/min, 250. C @ 60. min
CapillaryPEG-20M1095.Shimoda, Nakada, et al., 199760. m/0.25 mm/0.25 μm, He, 2. K/min, 230. C @ 60. min; Tstart: 50. C
CapillaryDB-Wax1104.Shimoda, Peralta, et al., 199660. m/0.25 mm/0.25 μm, He, 3. K/min; Tstart: 50. C; Tend: 230. C
CapillaryDB-Wax1095.Shimoda, Shiratsuchi, et al., 199660. m/0.25 mm/0.25 μm, He, 2. K/min, 230. C @ 60. min; Tstart: 50. C
CapillaryDB-Wax1093.Shiratsuchi, Shimoda, et al., 199360. m/0.25 mm/0.25 μm, 50. C @ 4. min, 2. K/min, 230. C @ 30. min
CapillaryCP-Wax 52CB1063.Yu, Wu, et al., 199350. m/0.32 mm/0.25 μm, H2, 40. C @ 10. min, 1.5 K/min, 200. C @ 60. min

Van Den Dool and Kratz RI, polar column, custom temperature program

View large format table.

Column type Active phase I Reference Comment
CapillarySupelcowax-101100.Bianchi, Careri, et al., 200730. m/0.25 mm/0.25 μm, He; Program: 35C(8min) => 4C/min => 60C => 6C/min => 160C => 20C/min => 200C(1min)
CapillaryDB-Wax1088.Cantergiani, Brevard, et al., 200130. m/0.25 mm/0.25 μm; Program: 20C(30s) => fast => 60C => 4C/min => 220C (20min)

Normal alkane RI, non-polar column, temperature ramp

View large format table.

Column type Active phase I Reference Comment
CapillaryHP-5 MS737.Kim and Chung, 200930. m/0.25 mm/0.25 μm, Helium, 35. C @ 5. min, 2. K/min, 195. C @ 30. min
CapillaryMDN-5740.van Loon, Linssen, et al., 200560. m/0.25 mm/0.25 μm, He, 40. C @ 4. min, 4. K/min, 270. C @ 5. min
CapillaryDB-5741.Joffraud, Leroi, et al., 200160. m/0.32 mm/1. μm, He, 40. C @ 5. min, 3. K/min; Tend: 200. C
CapillaryDB-1722.Chen and Ho, 199960. m/0.32 mm/1. μm, He, 2. K/min; Tstart: 40. C; Tend: 260. C
CapillaryHP-1752.Ong and Acree, 19984. K/min; Column length: 25. m; Column diameter: 0.32 mm; Tstart: 35. C; Tend: 250. C
CapillaryDB-1720.Rapior, Breheret, et al., 199730. m/0.2 mm/0.25 μm, He, 50. C @ 2. min, 4. K/min; Tend: 200. C
CapillaryDB-1708.Buttery, Teranishi, et al., 1990He, 30. C @ 25. min, 4. K/min, 200. C @ 5. min; Column length: 60. m; Column diameter: 0.25 mm
CapillaryOV-1722.Schreyen, Dirinck, et al., 1979N2, 1. K/min; Column length: 183. m; Column diameter: 0.762 mm; Tstart: 0. C; Tend: 230. C

Normal alkane RI, non-polar column, custom temperature program

View large format table.

Column type Active phase I Reference Comment
CapillaryRTX-5 MS715.Mebazaa, Mahmoudi, et al., 200930. m/0.25 mm/0.25 μm, Helium; Program: not specified
CapillaryDB-5 MS744.Cajka, Hajslova, et al., 200730. m/0.25 mm/0.25 μm, Helium; Program: 45 0C (0.75 min) 10 0C/min -> 200 0C 30 0C/min -> 245 0C (1.25 min)
CapillaryDB-5 MS748.Liu, Xu, et al., 200760. m/0.32 mm/1.0 μm, Helium; Program: 40 0C (2 min) 6 0C/min -> 100 0C 4 0C/min -> 180 0C 8 0C/min -> 250 0C (12 min)
CapillaryHP-5748.Garcia-Estaban, Ansorena, et al., 200450. m/0.32 mm/1.05 μm; Program: 40C(10min) => 5C/min => 200C => 20C/min => 250C(5min)
CapillaryDB-5748.Garcia-Estaban, Ansorena, et al., 2004, 250. m/0.32 mm/1.05 μm; Program: 40C(10min) => 5C/min => 200C => 20C/min => 250C (5min)

Normal alkane RI, polar column, temperature ramp

View large format table.

Column type Active phase I Reference Comment
CapillaryCP Wax 52 CB1095.Birtic, Ginies, et al., 200930. m/0.32 mm/0.50 μm, Helium, 40. C @ 2. min, 4. K/min, 230. C @ 15. min
CapillaryHP-Innowax1101.Soria, Sanz, et al., 200850. m/0.20 mm/0.20 μm, Helium, 45. C @ 2. min, 4. K/min, 190. C @ 50. min
CapillaryZB-Wax1109.Wierda R.L., Fletcher G., et al., 200660. m/0.32 mm/0.5 μm, He, 40. C @ 2. min, 3. K/min, 250. C @ 10. min
CapillaryCarbowax 20M1093.de la Fuente, Martinez-Castro, et al., 200550. m/0.25 mm/0.25 μm, Helium, 40. C @ 2. min, 4. K/min, 190. C @ 30. min
CapillaryDB-Wax1119.Qian and Wang, 200560. m/0.32 mm/0.50 μm, Nitrogen, 35. C @ 4. min, 2. K/min, 235. C @ 30. min
CapillaryHP-Innowax1085.Wijaya, Ulrich, et al., 200515. m/0.25 mm/1. μm, 45. C @ 5. min, 10. K/min, 210. C @ 5. min
CapillaryTC-Wax1104.Ishikawa, Ito, et al., 200460. m/0.25 mm/0.5 μm, He, 40. C @ 8. min, 3. K/min; Tend: 230. C
CapillaryHP-Innowax1084.Soria, Gonzalez, et al., 200450. m/0.2 mm/0.2 μm, He, 45. C @ 2. min, 4. K/min, 190. C @ 50. min
CapillaryRTX-Wax1108.Galindo-Cuspinera, Lubran, et al., 200260. m/0.25 mm/0.5 μm, He, 40. C @ 5. min, 5. K/min, 180. C @ 20. min
CapillaryHP-FFAP1073.Qian and Reineccius, 200225. m/0.32 mm/0.52 μm, 60. C @ 1. min, 5. K/min, 240. C @ 5. min
CapillaryHP-Wax1102.Sanz, Maeztu, et al., 200260. m/0.25 mm/0.5 μm, He, 40. C @ 6. min, 3. K/min; Tend: 190. C
CapillaryHP-Wax1102.Maeztu, Sanz, et al., 200160. m/0.25 mm/0.5 μm, He, 40. C @ 6. min, 3. K/min; Tend: 190. C
CapillaryHP-Wax1102.Sanz, Ansorena, et al., 200160. m/0.25 mm/0.5 μm, He, 40. C @ 6. min, 3. K/min; Tend: 190. C
CapillarySupelcowax-101114.Girard and Lau, 199590. m/0.25 mm/0.25 μm, He, 35. C @ 20. min, 2. K/min, 220. C @ 30. min
CapillaryDB-Wax1093.Shimoda, Shiratsuchi, et al., 199360. m/0.25 mm/0.25 μm, He, 50. C @ 4. min, 2. K/min; Tend: 230. C
CapillaryCarbowax 20M1073.Kawakami and Kobayashi, 1991He, 60. C @ 4. min, 2. K/min; Column length: 50. m; Column diameter: 0.25 mm; Tend: 180. C

Normal alkane RI, polar column, custom temperature program

View large format table.

Column type Active phase I Reference Comment
CapillaryDB-Wax1129.Kadar, Juan-Borras, et al., 201060. m/0.32 mm/1.0 μm, Helium; Program: 40 0C (2 min) 4 0C/min -> 190 0C (11 min) 8 0C/min -> 220 0C (8 min)
CapillaryDB-FFAP1091.Mebazaa, Mahmoudi, et al., 200930. m/0.25 mm/0.25 μm, Helium; Program: 50 0C 2 0C/min -> 100 0C (5 min) 5 0C/min -> 250 0C
CapillaryDB-FFAP1090.Mebazaa, Mahmoudi, et al., 200930. m/0.25 mm/0.25 μm, Helium; Program: not specified
CapillarySupelcowax-101101.Soria, Martinez-Castro, et al., 200950. m/0.25 mm/0.25 μm, Helium; Program: 45 0C (15 min) 3 0C/min -> 75 0C 5 0C/min -> 180 0C (10 min)
CapillarySupelcowax 101101.Soria, Martinez-Castro, et al., 200850. m/0.25 mm/0.25 μm, Helium; Program: 45 0C (15 min) 3 0C/min -> 75 0C 5 0C/min -> 180 0C (10 min)
CapillarySupelcowax 101101.Soria, Martinez-Castro, et al., 200850. m/0.25 mm/0.25 μm, Helium; Program: 45 0C (15 min) 3 0C/min -> 75 0C 5 0C/min -> 180 0C (10 min)
CapillaryDB-Wax1090.Gyawalia, Seo, et al., 200660. m/0.2 mm/0.25 μm, He; Program: 40C(3min) => 2C/min => 150C => 4C/min => 220C(20min) => 5C/min => 230C
CapillaryDB-Wax1087.Kim. J.H., Ahn, et al., 200460. m/0.25 mm/0.25 μm, Helium; Program: 60 0C (3 min) 2 0C/min -> 150 0C 4 0C/min -> 200 0C

References

Bartley and Schwede, 1989
Bartley, J.P.; Schwede, A.M., Production of volatile componds in ripening kiwi fruit (Actinidia chinensis), J. Agric. Food Chem., 1989, 37, 4, 1023-1025, https://doi.org/10.1021/jf00088a046 . [all data]

Shibamoto, Kamiya, et al., 1981
Shibamoto, T.; Kamiya, Y.; Mihara, S., Isolation and identification of volatile compounds in cooked meat: sukiyaki, J. Agric. Food Chem., 1981, 29, 1, 57-63, https://doi.org/10.1021/jf00103a015 . [all data]

Oruna-Concha, Bakker, et al., 2002
Oruna-Concha, M.J.; Bakker, J.; Ames, J.M., Comparison of the volatile components of two cultivars of potato cooked by boiling, conventional baking and microwave baking, J. Sci. Food Agric., 2002, 82, 9, 1080-1087, https://doi.org/10.1002/jsfa.1148 . [all data]

Parker, Hassell, et al., 2000
Parker, J.K.; Hassell, G.M.E.; Mottram, D.S.; Guy, R.C.E., Sensory and instrumental analyses of volatiles generated during the extrusion cooking of oat flours, J. Agric. Food Chem., 2000, 48, 8, 3497-3506, https://doi.org/10.1021/jf991302r . [all data]

Calvo-Gómez, Morales-López, et al., 2004
Calvo-Gómez, O.; Morales-López, J.; López, M.G., Solid-phase microextraction-gas chromatographic-mass spectrometric analysis of garlic oil obtained by hydrodistillation, J. Chromatogr. A, 2004, 1036, 1, 91-93, https://doi.org/10.1016/j.chroma.2004.02.072 . [all data]

Pino and Marbot, 2001
Pino, J.A.; Marbot, R., Volatile flavor constituents of acerola (Malpighia emarginata DC.) fruit, J. Agric. Food Chem., 2001, 49, 12, 5880-5882, https://doi.org/10.1021/jf010270g . [all data]

Shimoda, Nakada, et al., 1997
Shimoda, M.; Nakada, Y.; Nakashima, M.; Osajima, Y., Quantitative comparison of volatile flavor compounds in deep-roasted and light-roasted sesame seed oil, J. Agric. Food Chem., 1997, 45, 8, 3193-3196, https://doi.org/10.1021/jf970172o . [all data]

Shimoda, Peralta, et al., 1996
Shimoda, M.; Peralta, R.R.; Osajima, Y., Headspace gas analysis of fish sauce, J. Agric. Food Chem., 1996, 44, 11, 3601-3605, https://doi.org/10.1021/jf960345u . [all data]

Shimoda, Shiratsuchi, et al., 1996
Shimoda, M.; Shiratsuchi, H.; Nakada, Y.; Wu, Y.; Osajima, Y., Identification and sensory characterization of volatile flavor compounds in sesame seed oil, J. Agric. Food Chem., 1996, 44, 12, 3909-3912, https://doi.org/10.1021/jf960115f . [all data]

Shiratsuchi, Shimoda, et al., 1993
Shiratsuchi, H.; Shimoda, M.; Minegishi, Y.; Osajima, Y., Isolation and identification of volatile flavor compounds in nonfermented coarse-cut sausage. Flavor as a quality factor of nonfermented sausage. 1, J. Agric. Food Chem., 1993, 41, 4, 647-652, https://doi.org/10.1021/jf00028a027 . [all data]

Yu, Wu, et al., 1993
Yu, T.-H.; Wu, C.-M.; Ho, C.-T., Volatile compounds of deep-oil fried, microwave-heated, and oven-baked garlic slices, J. Agric. Food Chem., 1993, 41, 5, 800-805, https://doi.org/10.1021/jf00029a023 . [all data]

Bianchi, Careri, et al., 2007
Bianchi, F.; Careri, M.; Mangia, A.; Musci, M., Retention indices in the analysis of food aroma volatile compounds in temperature-programmed gas chromatography: Database creation and evaluation of precision and robustness, J. Sep. Sci., 2007, 39, 4, 563-572, https://doi.org/10.1002/jssc.200600393 . [all data]

Cantergiani, Brevard, et al., 2001
Cantergiani, E.; Brevard, H.; Krebs, Y.; Feria-Morales, A.; Amadò, R.; Yeretzian, C., Characterisation of the aroma of green Mexican coffee and identification of mouldy/earthy defect, Eur. Food Res. Technol., 2001, 212, 6, 648-657, https://doi.org/10.1007/s002170100305 . [all data]

Kim and Chung, 2009
Kim, J.-S.; Chung, H.Y., GC-MS analysis of the volatile components in dried boxthorn (Lycium chimensis) Fruit, J. Korean Soc. Appl. Biol. Chem., 2009, 52, 5, 516-524, https://doi.org/10.3839/jksabc.2009.088 . [all data]

van Loon, Linssen, et al., 2005
van Loon, W.A.M.; Linssen, J.P.H.; Legger, A.; Posthumus, M.A.; Voragen, A.G.J., Identification and olfactometry of French fries flavour extracted at mouth conditions, Food Chem., 2005, 90, 3, 417-425, https://doi.org/10.1016/j.foodchem.2004.05.005 . [all data]

Joffraud, Leroi, et al., 2001
Joffraud, J.J.; Leroi, F.; Roy, C.; Berdagué, J.L., Characterisation of volatile compounds produced by bacteria isolated from the spoilage flora of cold-smoked salmon, Int. J. Food Microbiol., 2001, 66, 3, 175-184, https://doi.org/10.1016/S0168-1605(00)00532-8 . [all data]

Chen and Ho, 1999
Chen, J.; Ho, C.-T., Comparison of volatile generation in serine/threonine/glutamine-ribose/glucose/fructose model systems, J. Agric. Food Chem., 1999, 47, 2, 643-647, https://doi.org/10.1021/jf980771a . [all data]

Ong and Acree, 1998
Ong, P.K.C.; Acree, T.E., Gas chromatography/olfactory analysis of lychee (Litchi chinesis Sonn.), J. Agric. Food Chem., 1998, 46, 6, 2282-2286, https://doi.org/10.1021/jf9801318 . [all data]

Rapior, Breheret, et al., 1997
Rapior, S.; Breheret, S.; Talou, T.; Bessiére, J.-M., Volatile flavor constituents of fresh Marasmius alliaceus (garlic Marasmius), J. Agric. Food Chem., 1997, 45, 3, 820-825, https://doi.org/10.1021/jf960511y . [all data]

Buttery, Teranishi, et al., 1990
Buttery, R.G.; Teranishi, R.; Ling, L.C.; Turnbaugh, J.G., Quantitative and sensory studies on tomato paste volatiles, J. Agric. Food Chem., 1990, 38, 1, 336-340, https://doi.org/10.1021/jf00091a074 . [all data]

Schreyen, Dirinck, et al., 1979
Schreyen, L.; Dirinck, P.; Sandra, P.; Schamp, N., Flavor analysis of quince, J. Agric. Food Chem., 1979, 27, 4, 872-876, https://doi.org/10.1021/jf60224a058 . [all data]

Mebazaa, Mahmoudi, et al., 2009
Mebazaa, R.; Mahmoudi, A.; Fouchet, M.; Dos Santos, M.; Kamissoko, F.; Nafti, A.; Ben Cheikh, R.; Rega, B.; Camel, V., Characterization of volatile compounds in Tunisian fenugreek seeds, Food Chem., 2009, 115, 4, 1326-1336, https://doi.org/10.1016/j.foodchem.2009.01.066 . [all data]

Cajka, Hajslova, et al., 2007
Cajka, T.; Hajslova, J.; Cochran, J.; Holadova, K.; Klimankova, E., Solid phase microextraction - comprehensive two dimensional gas chromatography - time-of-flight mass spectrometry for the analysis of honey volatiles, J. Sep. Sci., 2007, 30, 4, 534-546, https://doi.org/10.1002/jssc.200600413 . [all data]

Liu, Xu, et al., 2007
Liu, Y.; Xu, X.-L.; Zhou, G.-H., Comparative study of volatile compounds in traditional Chinese Nanjing marinated duck by different extraction techniques, Int. J. Food Sci. Technol., 2007, 42, 5, 543-550, https://doi.org/10.1111/j.1365-2621.2006.01264.x . [all data]

Garcia-Estaban, Ansorena, et al., 2004
Garcia-Estaban, M.; Ansorena, D.; Astiasaran, I.; Martin, D.; Ruiz, J., Comparison of simultaneous distillation extraction (SDE) and solid-phase microextraction (SPME) for the analysis of volatile compounds in dry-cured ham, J. Sci. Food Agric., 2004, 84, 11, 1364-1370, https://doi.org/10.1002/jsfa.1826 . [all data]

Garcia-Estaban, Ansorena, et al., 2004, 2
Garcia-Estaban, M.; Ansorena, D.; Astiasarán, I.; Ruiz, J., Study of the effect of different fiber coatings and extraction conditions on dry cured ham volatile compounds extracted by solid-phase microextraction (SPME), Talanta, 2004, 64, 2, 458-466, https://doi.org/10.1016/j.talanta.2004.03.007 . [all data]

Birtic, Ginies, et al., 2009
Birtic, S.; Ginies, C.; Causse, M.; Renard, C.M.G.C.; Page, D., Changes in volatiles and glycosides during fruit maturartion of two contrasted tomato (Solanum lycopersicum) lines, J. Agric. Food Chem., 2009, 57, 2, 591-598, https://doi.org/10.1021/jf8023062 . [all data]

Soria, Sanz, et al., 2008
Soria, A.C.; Sanz, J.; Martinez-Castro, I., SPME followed by GC-MS: a powerful technique for qualitative analysis of honey volatiles, Eur. Food Res. Technol., 2008, 1-12. [all data]

Wierda R.L., Fletcher G., et al., 2006
Wierda R.L.; Fletcher G.; Xu L.; Dufour J.P., Analysis of volatile compounds as spoilage indicators in fresh king salmon (Oncorhynchus tshawytscha) during storage using SPME-GC-MS, J. Agric. Food Chem., 2006, 54, 22, 8480-8490, https://doi.org/10.1021/jf061377c . [all data]

de la Fuente, Martinez-Castro, et al., 2005
de la Fuente, E.; Martinez-Castro, I.; Sanz, J., Characterization of Spanish unifloral honeys by solid phase microextraction and gas chromatography-mass spectrometry, J. Sep. Sci., 2005, 28, 9-10, 1093-1100, https://doi.org/10.1002/jssc.200500018 . [all data]

Qian and Wang, 2005
Qian, M.C.; Wang, Y., Seasonal Variations of Volatile Composition and Odor Activity Value of Marion (Rubus spp. hyb) and Thornless Evergreen (R.laciniatus L.) Blackberries, J. Food. Sci., 2005, 70, 1, c13-c20, https://doi.org/10.1111/j.1365-2621.2005.tb09013.x . [all data]

Wijaya, Ulrich, et al., 2005
Wijaya, C.H.; Ulrich, D.; Lestari, R.; Schippel, K.; Ebert, G., Identification of potent odorants in different cultivars of snake fruit [Salacca zalacca (Gaert.) Voss] using gas chromatography-olfactometry, J. Agric. Food Chem., 2005, 53, 5, 1637-1641, https://doi.org/10.1021/jf048950h . [all data]

Ishikawa, Ito, et al., 2004
Ishikawa, M.; Ito, O.; Ishizaki, S.; Kurobayashi, Y.; Fujita, A., Solid-phase aroma concentrate extraction (SPACE ): a new headspace technique for more sensitive analysis of volatiles, Flavour Fragr. J., 2004, 19, 3, 183-187, https://doi.org/10.1002/ffj.1322 . [all data]

Soria, Gonzalez, et al., 2004
Soria, A.C.; Gonzalez, M.; de Lorenzo, C.; Martinez-Castro, I.; Sanza, J., Characterization of artisanal honeys from Madrid (Central Spain) on the basis of their melissopalynological, physicochemical and volatile composition data, Food Chem., 2004, 85, 1, 121-130, https://doi.org/10.1016/j.foodchem.2003.06.012 . [all data]

Galindo-Cuspinera, Lubran, et al., 2002
Galindo-Cuspinera, V.; Lubran, M.B.; Rankin, S.A., Comparison of volatile compounds in water- and oil-soluble annatto (Bixa orellana L.) extracts, J. Agric. Food Chem., 2002, 50, 7, 2010-2015, https://doi.org/10.1021/jf011325h . [all data]

Qian and Reineccius, 2002
Qian, M.; Reineccius, G., Identification of aroma compounds in Parmigiano-Reggiano cheese by gas chromatography/olfactometry, J. Dairy Sci., 2002, 85, 6, 1362-1369, https://doi.org/10.3168/jds.S0022-0302(02)74202-1 . [all data]

Sanz, Maeztu, et al., 2002
Sanz, C.; Maeztu, L.; Zapelena, M.J.; Bello, J.; Cid, C., Profiles of volatile compounds and sensory analysis of three blends of coffee: influence of different proportions of Arabica and Robusta and influence of roasting coffee with sugar, J. Sci. Food Agric., 2002, 82, 8, 840-847, https://doi.org/10.1002/jsfa.1110 . [all data]

Maeztu, Sanz, et al., 2001
Maeztu, L.; Sanz, C.; Andueza, S.; de Peña, M.P.; Bello, J.; Cid, C., Characterization of espresso coffee aroma by static headspace GC-MS and sensory flavor profile, J. Agric. Food Chem., 2001, 49, 11, 5437-5444, https://doi.org/10.1021/jf0107959 . [all data]

Sanz, Ansorena, et al., 2001
Sanz, C.; Ansorena, D.; Bello, J.; Cid, C., Optimizing headspace temperature and time sampling for identification of volatile compounds in ground roasted Arabica coffee, J. Agric. Food Chem., 2001, 49, 3, 1364-1369, https://doi.org/10.1021/jf001100r . [all data]

Girard and Lau, 1995
Girard, B.; Lau, O.L., Effect of maturity and storage on quality and volatile production of 'Jonagold' apples, Food Res. Int., 1995, 28, 5, 465-471, https://doi.org/10.1016/0963-9969(96)81393-7 . [all data]

Shimoda, Shiratsuchi, et al., 1993
Shimoda, M.; Shiratsuchi, H.; Minegishi, Y.; Osajima, Y., Flavor deterioration of nonfermented coarse-cut sausage during storage. Flavor as a factor of quality for nonfermented sausage. 2, J. Agric. Food Chem., 1993, 41, 6, 946-950, https://doi.org/10.1021/jf00030a021 . [all data]

Kawakami and Kobayashi, 1991
Kawakami, M.; Kobayashi, A., Volatitle constituents of greem mate and roasted mate, J. Agric. Food Chem., 1991, 39, 7, 1275-1279, https://doi.org/10.1021/jf00007a016 . [all data]

Kadar, Juan-Borras, et al., 2010
Kadar, M.; Juan-Borras, M.; Hellebrandova, M.; Domenech, E.; Escriche, I., Volatile fraction composition of Acacia (Robinia pseudoacacia) honey from Romania, Spain, and Check Republic, Bull. USAMV Agriculture, 2010, 67, 2, 259-265. [all data]

Soria, Martinez-Castro, et al., 2009
Soria, A.C.; Martinez-Castro, I.; Sanz, J., Study of the precision in the purge-and-trap-gas-chromatography-mass-spectrometry analysis of volatile compounds in honey, J. Chromatogr. A., 2009, 1216, 15, 3300-3304, https://doi.org/10.1016/j.chroma.2009.01.065 . [all data]

Soria, Martinez-Castro, et al., 2008
Soria, A.C.; Martinez-Castro, I.; Sanz, J., Some aspects of dynamic headspace analysis of volatile components in honey, Foog Res. International, 2008, 41, 8, 838-848, https://doi.org/10.1016/j.foodres.2008.07.010 . [all data]

Gyawalia, Seo, et al., 2006
Gyawalia, R.; Seo, H.-Y.; Lee, H.-J.; Song, H.-P.; Kim, D.-H.; Byun, M.-W.; Kim, K.-S., Effect of γ-irradiation on volatile compounds of dried Welsh onion (Allium fistulosum L.), Radiat. Phys. Chem., 2006, 75, 2, 322-328, https://doi.org/10.1016/j.radphyschem.2005.07.001 . [all data]

Kim. J.H., Ahn, et al., 2004
Kim. J.H.; Ahn, H.J.; Yook, H.S.; Kim, K.S.; Rhee, M.S.; Ryu, G.H.; Byun, M.W., Color, flavor, and sensory characteristics of gamma-irradiated salted and fermented anchovy sauce, Radiation Phys. Chem., 2004, 69, 2, 179-187, https://doi.org/10.1016/S0969-806X(03)00400-6 . [all data]