1,2-Hydrazinedicarboxamide

Condensed phase thermochemistry data

Data compiled by: Hussein Y. Afeefy, Joel F. Liebman, and Stephen E. Stein

Quantity Value Units Method Reference Comment
Δfsolid-498.7 ± 1.2kJ/molCcbWilliams, McEwan, et al., 1957
Quantity Value Units Method Reference Comment
Δcsolid-1145.9 ± 1.2kJ/molCcbWilliams, McEwan, et al., 1957
Δcsolid-1151.kJ/molCcbHandrick, 1956Naval Powder Factory, 1952
Δcsolid-1146.6 ± 0.63kJ/molCcbSullivan, Kibler, et al., 1948

References

Williams, McEwan, et al., 1957
Williams, M.M.; McEwan, W.S.; Henry, R.A., The heats of combustion of substituted triazoles, tetrazoles and related high nitrogen compounds, J. Phys. Chem., 1957, 61, 261-267. [all data]

Handrick, 1956
Handrick, G.R., Report of the study of pure explosive compounds. Part IV. Calculation of heat of combustion of organic compounds from structural features and calculation of power of high explosives, Rpt. C-58247 for the Office of the Chief of Ordnance, contract DA-19-020-ORD-47 by the Arthur D. Little, Inc., Cambridge, MA, 1956, 467-573. [all data]

Sullivan, Kibler, et al., 1948
Sullivan, M.V.; Kibler, G.M.; Hunt, H., Heats of combustion of nitrogen containing compounds, Rpt. Tech. Memo. PUR-3 for USN Project SQUID Contract N6ori-104, Task Order No. 1 Designation No. NR 22 042 by Purdue University, Lafayette, IN, 1948, 1-46. [all data]