2,5-Hexanediol, 2,5-dimethyl-

Phase change data

Data compiled as indicated in comments:
BS - Robert L. Brown and Stephen E. Stein
TRC - Thermodynamics Research Center, NIST Boulder Laboratories, Chris Muzny director
AC - William E. Acree, Jr., James S. Chickos

Quantity Value Units Method Reference Comment
Tboil487.2KN/AWeast and Grasselli, 1989BS
Quantity Value Units Method Reference Comment
Tfus362.KN/ABruson and Kroeger, 1940Uncertainty assigned by TRC = 3. K; the hydrate, 6H2O, melts at 38 deg C; TRC
Quantity Value Units Method Reference Comment
Δvap85.2 ± 3.5kJ/molCGCUmnahanant, Kweskin, et al., 2006AC

In addition to the Thermodynamics Research Center (TRC) data available from this site, much more physical and chemical property data is available from the following TRC products:

References

Weast and Grasselli, 1989
CRC Handbook of Data on Organic Compounds, 2nd Editon, Weast,R.C and Grasselli, J.G., ed(s)., CRC Press, Inc., Boca Raton, FL, 1989, 1. [all data]

Bruson and Kroeger, 1940
Bruson, H.A.; Kroeger, J.W., Cycli-Alkylation of Aromatic Compounds by the Friedel and Crafts Reaction, J. Am. Chem. Soc., 1940, 62, 36-44. [all data]

Umnahanant, Kweskin, et al., 2006
Umnahanant, Pataporn; Kweskin, Shasha; Nichols, Gary; Dunn, Matthew J.; Smart-Ebinne, Hareta; Chickos, James S., Vaporization Enthalpies of the α,ω-Alkanediols by Correlation Gas Chromatography, J. Chem. Eng. Data, 2006, 51, 6, 2246-2254, https://doi.org/10.1021/je060333x . [all data]