Glycinonitrile, n-methylene-

Gas phase ion energetics data

Data compiled by: Sharon G. Lias, John E. Bartmess, Joel F. Liebman, John L. Holmes, Rhoda D. Levin, and W. Gary Mallard

Ionization energy determinations

IE (eV) Method Reference Comment
10.2PEDammel and Bock, 1987
10.60PEDammel and Bock, 1987Vertical value

References

Dammel and Bock, 1987
Dammel, R.; Bock, H., Darstellung von monomerem methylenaminoacetonitril H2C = N - CH2 - CN in der gasphase [1], Z. Naturforsch. B:, 1987, 42, 810. [all data]