1,3-Propanediamine, N,N-dimethyl-

Gas phase thermochemistry data

Data compiled as indicated in comments:
ALS - Hussein Y. Afeefy, Joel F. Liebman, and Stephen E. Stein
DRB - Donald R. Burgess, Jr.

Quantity Value Units Method Reference Comment
Δfgas-34.7 ± 4.0kJ/molCcbPapina, Pimenova, et al., 1992ALS
Δfgas-35.1kJ/molN/ALebedeva, Gutner, et al., 1984Value computed using ΔfHliquid° value of -77.3±0.5 kj/mol from Lebedeva, Gutner, et al., 1984 and ΔvapH° value of 42.2 kj/mol from Papina, Pimenova, et al., 1992.; DRB
Δfgas-44.8kJ/molCcbVasil'eva and Kotov, 1977hf298 calculated possible error by author; ALS

Phase change data

Data compiled as indicated in comments:
DH - Eugene S. Domalski and Elizabeth D. Hearing
BS - Robert L. Brown and Stephen E. Stein
TRC - Thermodynamics Research Center, NIST Boulder Laboratories, Chris Muzny director
ALS - Hussein Y. Afeefy, Joel F. Liebman, and Stephen E. Stein
DRB - Donald R. Burgess, Jr.

Quantity Value Units Method Reference Comment
Tboil406.KN/ALebedeva, Gutner, et al., 1984P = 9.972x104 kPa.; DH
Tboil405.2KN/AWeast and Grasselli, 1989BS
Quantity Value Units Method Reference Comment
Ttriple194.43KN/ADzhafarov, Karasharli, et al., 1982Uncertainty assigned by TRC = 0.02 K; TRC
Quantity Value Units Method Reference Comment
Δvap10.10 ± 0.02kcal/molCPapina, Pimenova, et al., 1992ALS
Δvap10.1kcal/molN/APapina, Pimenova, et al., 1992DRB
Δvap11.30kcal/molVVasil'eva and Kotov, 1977hf298 calculated possible error by author; ALS

Enthalpy of vaporization

ΔvapH (kcal/mol) Temperature (K) Method Reference Comment
10.5 ± 0.05290.VLebedeva, Gutner, et al., 1984, 2ALS

Enthalpy of fusion

ΔfusH (kcal/mol) Temperature (K) Reference Comment
2.9601194.43Dzhafarov, Karasharli, et al., 1982, 2Glass to crystal transition at 135 K shown graphically.; DH

Entropy of fusion

ΔfusS (cal/mol*K) Temperature (K) Reference Comment
15.22194.43Dzhafarov, Karasharli, et al., 1982, 2Glass; DH

In addition to the Thermodynamics Research Center (TRC) data available from this site, much more physical and chemical property data is available from the following TRC products:

References

Papina, Pimenova, et al., 1992
Papina, T.S.; Pimenova, S.M.; Zakharov, V.Yu.; Kolesov, V.P., Standard enthalpies of formation of derivatives of perfluoro-2-methyl-3-oxahexanoic acid and 3-(N,N-dimethylamino)propyl amine, Zh. Khim. Termodin. Termokhim., 1992, 1, 207-211. [all data]

Lebedeva, Gutner, et al., 1984
Lebedeva, N.D.; Gutner, N.M.; Katin, Yu.A.; Kozlova, N.M.; Kiseleva, N.N.; Makhina, E.F.; Dobychin, S.L., Thermochemical study of bis-hydroxyethylpiperazine, N,N-dimethylpropylenediamine, and 2,2-azodiisobutyrodinitrile, J. Appl. Chem. USSR, 1984, 57, 2118-2122. [all data]

Vasil'eva and Kotov, 1977
Vasil'eva, T.F.; Kotov, V.I., Heats of combustion of dimethyl-substituted amides and dimethylalkylamines, Vses. Konf. Kalorim. Rasshir. Tezisy Dokl. 7th, 1977, 1, 102-106. [all data]