Benzene, 4-pentenyl-

Phase change data

Data compiled by: Thermodynamics Research Center, NIST Boulder Laboratories, Chris Muzny director

Quantity Value Units Method Reference Comment
Tboil471.15KN/ARamart-Lucas and Amagat, 1932Uncertainty assigned by TRC = 2. K

In addition to the Thermodynamics Research Center (TRC) data available from this site, much more physical and chemical property data is available from the following TRC products:

References

Ramart-Lucas and Amagat, 1932
Ramart-Lucas; Amagat, P., Absorption in the Ultra-violet of the Ethylenic Hydrocarbons, C6H5(CH2)nCH-CH2, Bull. Soc. Chim. Fr., 1932, 51, 965-8. [all data]