cis-3-Azonoradamantane

Reaction thermochemistry data

Data compiled by: Hussein Y. Afeefy, Joel F. Liebman, and Stephen E. Stein

Individual Reactions

cis-3-Azonoradamantane = Diazene, bis(hexahydro-2,5-methanopentalen-3a(1H)-yl)-, (E)-

By formula: C18H26N2 = C18H26N2

Quantity Value Units Method Reference Comment
Δr-17.58 ± 0.40kJ/molKinSchmittel and Ruchardt, 1987solid phase; solvent: Mesitylene

References

Schmittel and Ruchardt, 1987
Schmittel, M.; Ruchardt, C., Stereoisomerization and homolytic decomposition of cis and trans bridgehead diazenes, J. Am. Chem. Soc., 1987, 109, 2750-2759. [all data]