Trigermane, octamethyl-

Gas phase ion energetics data

Data compiled by: Sharon G. Lias, John E. Bartmess, Joel F. Liebman, John L. Holmes, Rhoda D. Levin, and W. Gary Mallard

Ionization energy determinations

IE (eV) Method Reference Comment
7.6PETraven', Redchenko, et al., 1982
8.18PETraven', Redchenko, et al., 1982Vertical value

References

Traven', Redchenko, et al., 1982
Traven', V.F.; Redchenko, V.V.; Bartenev, Y.; Stepanov, B.I., Photoelectron spectra of permethyl-di-, -tri-, and -tetra-germanes, J. Gen. Chem. USSR, 1982, 52, 310, In original 358. [all data]