4H-1,2,4-Triazole, 4-methyl-

Gas phase ion energetics data

Data compiled by: Sharon G. Lias, Rhoda D. Levin, and Sherif A. Kafafi

Ionization energy determinations

IE (eV) Method Reference
9.3PEPalmer, Simpson, et al., 1981

References

Palmer, Simpson, et al., 1981
Palmer, M.H.; Simpson, I.; Wheeler, J.R., Gas phase tautomerism in the triazoles and tetrazoles: A study by photoelectron spectroscopy and ab initio molecular orbital calculations, Z. Naturforsch. A:, 1981, 36, 1246. [all data]