Propanoic acid, 3-amino-2-methyl-

Condensed phase thermochemistry data

Data compiled by: Hussein Y. Afeefy, Joel F. Liebman, and Stephen E. Stein

Quantity Value Units Method Reference Comment
Δfsolid-64.3 ± 0.38kcal/molCcbContineanu and Marchidan, 1994
Quantity Value Units Method Reference Comment
Δcsolid-619. ± 0.33kcal/molCcbContineanu and Marchidan, 1994

References

Contineanu and Marchidan, 1994
Contineanu, J.; Marchidan, D.I., The enthalpies of combustion and formation of some isomers of aminobutyric (aminobutanoic) acid, Rev. Roum. Chim., 1994, 39, 1391-1395. [all data]