Propanoic acid, ethenyl ester

Kovats' RI, non-polar column, isothermal

View large format table.

Column type Active phase Temperature (C) I Reference Comment
PackedSE-30150.648.Allen and Haken, 1970Celite 560 silanized; Column length: 3.7 m
PackedSE-30150.648.Germaine and Haken, 1969Celite 560; Column length: 3.7 m

Van Den Dool and Kratz RI, non-polar column, custom temperature program

View large format table.

Column type Active phase I Reference Comment
PackedSE-30669.Peng, Ding, et al., 1988Supelcoport; Chromosorb; Column length: 3.05 m; Program: 40C(5min) => 10C/min => 200C or 250C (60min)

Normal alkane RI, non-polar column, custom temperature program

View large format table.

Column type Active phase I Reference Comment
CapillarySE-30650.Vinogradov, 2004Program: not specified

Normal alkane RI, polar column, custom temperature program

View large format table.

Column type Active phase I Reference Comment
CapillaryCarbowax 20M960.Vinogradov, 2004Program: not specified

Phase change data

Data compiled by: William E. Acree, Jr., James S. Chickos

Enthalpy of vaporization

ΔvapH (kcal/mol) Temperature (K) Reference Comment
8.77336.Resa, González, et al., 2005Based on data from 321. - 368. K.

References

Allen and Haken, 1970
Allen, I.D.; Haken, J.K., Gas chromatography of homologous esters. Part IV. Influence of stationary phase polarity on retention of unsaturated esters, J. Chromatogr., 1970, 51, 415-422, https://doi.org/10.1016/S0021-9673(01)96890-6 . [all data]

Germaine and Haken, 1969
Germaine, R.W.; Haken, J.K., Gas chromatography of homologous esters. Part 2. Unsaturated esters, J. Chromatogr., 1969, 43, 43-47, https://doi.org/10.1016/S0021-9673(00)99163-5 . [all data]

Peng, Ding, et al., 1988
Peng, C.T.; Ding, S.F.; Hua, R.L.; Yang, Z.C., Prediction of Retention Indexes I. Structure-Retention Index Relationship on Apolar Columns, J. Chromatogr., 1988, 436, 137-172, https://doi.org/10.1016/S0021-9673(00)94575-8 . [all data]

Vinogradov, 2004
Vinogradov, B.A., Production, composition, properties and application of essential oils, 2004, retrieved from http://viness.narod.ru. [all data]