2,6-Diphenyltetrahydrothiopyran-4-one s,s-dioxide

Condensed phase thermochemistry data

Data compiled by: Hussein Y. Afeefy, Joel F. Liebman, and Stephen E. Stein

Quantity Value Units Method Reference Comment
Δcsolid-9157. ± 12.kJ/molCcbArndt, Martin, et al., 1935Unpublished results Lorenz and Sternitzke

References

Arndt, Martin, et al., 1935
Arndt, F.; Martin, G.T.O.; Partington, J.R., 133. Studies in dielectric polarisation. Part XII. Dipole moments and structure of thiopyrones and related compounds., J. Chem. Soc., 1935, 602-604. [all data]