2-Methoxy-5-(4-nitrophenyl)-1,3,4-oxadiazole

Reaction thermochemistry data

Data compiled by: Hussein Y. Afeefy, Joel F. Liebman, and Stephen E. Stein

Individual Reactions

2-Methoxy-5-(4-nitrophenyl)-1,3,4-oxadiazole = C9H7N3O4

By formula: C9H7N3O4 = C9H7N3O4

Quantity Value Units Method Reference Comment
Δr-395. ± 12.kJ/molCisoDessolin, Golfier, et al., 1986solid phase
Δr-95.3 ± 3.7kJ/molCisoDessolin, Golfier, et al., 1986liquid phase

References

Dessolin, Golfier, et al., 1986
Dessolin, M.; Golfier, M.; Gonthier-Vassal, A.; Szwarc, H., 1,3-rearrangements in the heterocyclic series. VIII. Differential scanning calorimetry (DSC) study of the thermal rearrangement of 2-aryl-5-methoxy-1,3,4-oxadiazoles, Nouv. J. Chim., 1986, 10, 753-760. [all data]