Tridodecylamine

Phase change data

Data compiled as indicated in comments:
TRC - Thermodynamics Research Center, NIST Boulder Laboratories, Chris Muzny director
AC - William E. Acree, Jr., James S. Chickos

Quantity Value Units Method Reference Comment
Tfus288.85KN/ARalston, Hoerr, et al., 1944Uncertainty assigned by TRC = 1. K; TRC

Enthalpy of vaporization

ΔvapH (kJ/mol) Temperature (K) Method Reference Comment
82.1594.AStephenson and Malanowski, 1987Based on data from 579. - 807. K.; AC

In addition to the Thermodynamics Research Center (TRC) data available from this site, much more physical and chemical property data is available from the following TRC products:

References

Ralston, Hoerr, et al., 1944
Ralston, A.W.; Hoerr, C.W.; Du Brow, P.L., Solubilities of High-Molecular-Weight Symmetrical Normal Aliphatic Tertiary Amines., J. Org. Chem., 1944, 9, 259-66. [all data]

Stephenson and Malanowski, 1987
Stephenson, Richard M.; Malanowski, Stanislaw, Handbook of the Thermodynamics of Organic Compounds, 1987, https://doi.org/10.1007/978-94-009-3173-2 . [all data]