2,2,9,9-Tetramethyldec-5-ene-3,7-diyne

Reaction thermochemistry data

Data compiled by: Hussein Y. Afeefy, Joel F. Liebman, and Stephen E. Stein

Individual Reactions

2,2,9,9-Tetramethyldec-5-ene-3,7-diyne = 5-Decene-3,7-diyne, 2,2,9,9-tetramethyl-, (Z)-

By formula: C14H20 = C14H20

Quantity Value Units Method Reference Comment
Δr3. ± 5.9kJ/molEqkRoth, Hopf, et al., 1994gas phase; At 993 K

References

Roth, Hopf, et al., 1994
Roth, W.R.; Hopf, H.; Horn, C., Propargyl-Stabilisierungsenergie, Chem. Ber., 1994, 127, 1781-1795. [all data]