1,2-Bis(triethylammonium)ethane dibromide

Condensed phase thermochemistry data

Data compiled by: Eugene S. Domalski and Elizabeth D. Hearing

Constant pressure heat capacity of solid

Cp,solid (J/mol*K) Temperature (K) Reference Comment
411.7298.Burns and Verrall, 1974T = 273 to 373 K.

References

Burns and Verrall, 1974
Burns, I.A.; Verrall, R.E., Thermodynamics of tetralkyl- and bis-tetraalkylammonium bromides. II. Heat capacities of solid state from 273 to 373 K, Thermochim. Acta, 1974, 9, 277-287. [all data]