2,4,6-Trinitro-N-methyl-aniline

Condensed phase thermochemistry data

Data compiled by: Hussein Y. Afeefy, Joel F. Liebman, and Stephen E. Stein

Quantity Value Units Method Reference Comment
Δfsolid-49.3 ± 3.6kJ/molCcbMedard and Thomas, 1955Heat of combustion corrected for pressure
Quantity Value Units Method Reference Comment
Δcsolid-3562.8 ± 2.4kJ/molCcbMedard and Thomas, 1955Heat of combustion corrected for pressure

References

Medard and Thomas, 1955
Medard, L.; Thomas, M., Chaleurs de combustion de sept substances explosives ou apparentees a des explosifs, Mem. Poudres, 1955, 37, 129-138. [all data]