N-Cyano-S,S'-dimethyldithioimido carbonate

Gas phase ion energetics data

Data compiled by: Sharon G. Lias, Rhoda D. Levin, and Sherif A. Kafafi

Ionization energy determinations

IE (eV) Method Reference Comment
9.1PEKlasinc, Butkovic, et al., 1980
9.40 ± 0.05PEKlasinc, Butkovic, et al., 1980Vertical value

References

Klasinc, Butkovic, et al., 1980
Klasinc, L.; Butkovic, V.; Novak, I.; Mihalic, M.; Toso, R.; Sunjic, V., Application of photoelectron spectroscopy to biologically active molecules and their constituent parts. VII. N-cyanoazomethines, Gazz. Chim. Ital., 1980, 110, 287. [all data]