Benzene, 1,3-bis(1-ethylpropyl)-

Reaction thermochemistry data

Data compiled by: Hussein Y. Afeefy, Joel F. Liebman, and Stephen E. Stein

Individual Reactions

Benzene, 1,4-bis(1-ethylpropyl)- = Benzene, 1,3-bis(1-ethylpropyl)-

By formula: C16H26 = C16H26

Quantity Value Units Method Reference Comment
Δr-0.25 ± 0.27kJ/molEqkPimerzin, Nesterova, et al., 1985liquid phase; AlCl3

References

Pimerzin, Nesterova, et al., 1985
Pimerzin, a.A.; Nesterova, T.N.; Rozhnov, A.M., Equilibria of isomeric transformations and relations between thermodynamic properties of secondary alkylbenzenes, J. Chem. Thermodyn., 1985, 17, 641-648. [all data]