1,3,5,7-Tetraazabicyclo[3.3.1]nonane, 3,7-dinitroso-

Condensed phase thermochemistry data

Data compiled by: Hussein Y. Afeefy, Joel F. Liebman, and Stephen E. Stein

Quantity Value Units Method Reference Comment
Δfsolid228.2 ± 3.6kJ/molCcbMedard and Thomas, 1955Author was aware that data differs from previously reported values; Reanalyzed by Cox and Pilcher, 1970, Original value = 241. kJ/mol
Δfsolid185.6kJ/molCcbDelepine and Badoche, 1942Author's hf298_condensed=51.45 kcal/mol
Quantity Value Units Method Reference Comment
Δcsolid-3624.9 ± 3.6kJ/molCcbMedard and Thomas, 1955Author was aware that data differs from previously reported values; Reanalyzed by Cox and Pilcher, 1970, Original value = -3630. kJ/mol
Δcsolid-3620.kJ/molCcbDelepine and Badoche, 1942Author's hf298_condensed=51.45 kcal/mol

References

Medard and Thomas, 1955
Medard, L.; Thomas, M., Chaleurs de combustion de treize substances explosives ou apparentees a des explosifs, Mem. Poudres, 1955, 38, 46-63. [all data]

Cox and Pilcher, 1970
Cox, J.D.; Pilcher, G., Thermochemistry of Organic and Organometallic Compounds, Academic Press, New York, 1970, 1-636. [all data]

Delepine and Badoche, 1942
Delepine, M.; Badoche, M., Thermochimie de l'aldehyde formique, de l'hexamethylene-tetramine et de ses derive, C. R. Acad. Sci. Paris, 1942, 214, 777-780. [all data]