Isoxazole, 3-phenyl-

Phase change data

Data compiled by: Hussein Y. Afeefy, Joel F. Liebman, and Stephen E. Stein

Quantity Value Units Method Reference Comment
Δvap64.0 ± 4.2kJ/molETappi, 1940Heat of formation derived by Cox and Pilcher, 1970

References

Tappi, 1940
Tappi, G., Sul calore di combustione degli isossiazoli, Gazz. Chim. Ital., 1940, 70, 414-422. [all data]

Cox and Pilcher, 1970
Cox, J.D.; Pilcher, G., Thermochemistry of Organic and Organometallic Compounds, Academic Press, New York, 1970, 1-636. [all data]