Benzene, 1-(bromomethyl)-4-nitro-

Phase change data

Data compiled by: Thermodynamics Research Center, NIST Boulder Laboratories, Chris Muzny director

Quantity Value Units Method Reference Comment
Tfus372.7KN/ABrewster, 1918Uncertainty assigned by TRC = 2. K

In addition to the Thermodynamics Research Center (TRC) data available from this site, much more physical and chemical property data is available from the following TRC products:

References

Brewster, 1918
Brewster, J.F., The Bromination of p-Nitrotoluene, J. Am. Chem. Soc., 1918, 40, 406-7. [all data]