Aniline, positive ion

Ion clustering data

Data compiled by: Michael M. Meot-Ner (Mautner) and Sharon G. Lias

Clustering reactions

C6H7N+ + Methane, iodo- = (C6H7N+ • Methane, iodo-)

By formula: C6H7N+ + CH3I = (C6H7N+ • CH3I)

Quantity Value Units Method Reference Comment
Δr41.kJ/molPHPMSMeot-Ner (Mautner) and El-Shall, 1986gas phase; Entropy change calculated or estimated
Quantity Value Units Method Reference Comment
Δr75.J/mol*KN/AMeot-Ner (Mautner) and El-Shall, 1986gas phase; Entropy change calculated or estimated

Free energy of reaction

ΔrG° (kJ/mol) T (K) Method Reference Comment
18.299.PHPMSMeot-Ner (Mautner) and El-Shall, 1986gas phase; Entropy change calculated or estimated

C6H7N+ + Methane, nitro- = (C6H7N+ • Methane, nitro-)

By formula: C6H7N+ + CH3NO2 = (C6H7N+ • CH3NO2)

Quantity Value Units Method Reference Comment
Δr60.2kJ/molPHPMSMeot-Ner (Mautner) and El-Shall, 1986gas phase; Entropy change calculated or estimated
Quantity Value Units Method Reference Comment
Δr75.J/mol*KN/AMeot-Ner (Mautner) and El-Shall, 1986gas phase; Entropy change calculated or estimated

Free energy of reaction

ΔrG° (kJ/mol) T (K) Method Reference Comment
34.343.PHPMSMeot-Ner (Mautner) and El-Shall, 1986gas phase; Entropy change calculated or estimated

C6H7N+ + Acetonitrile = (C6H7N+ • Acetonitrile)

By formula: C6H7N+ + C2H3N = (C6H7N+ • C2H3N)

Quantity Value Units Method Reference Comment
Δr72.4kJ/molPHPMSMeot-Ner (Mautner) and El-Shall, 1986gas phase
Quantity Value Units Method Reference Comment
Δr74.5J/mol*KPHPMSMeot-Ner (Mautner) and El-Shall, 1986gas phase

C6H7N+ + Benzene, hexafluoro- = (C6H7N+ • Benzene, hexafluoro-)

By formula: C6H7N+ + C6F6 = (C6H7N+ • C6F6)

Bond type: Charge transfer bond (positive ion)

Quantity Value Units Method Reference Comment
Δr47.3kJ/molPHPMSMeot-Ner (Mautner) and El-Shall, 1986gas phase; Entropy change calculated or estimated
Quantity Value Units Method Reference Comment
Δr110.J/mol*KN/AMeot-Ner (Mautner) and El-Shall, 1986gas phase; Entropy change calculated or estimated
Quantity Value Units Method Reference Comment
Δr15.kJ/molPHPMSMeot-Ner (Mautner) and El-Shall, 1986gas phase; Entropy change calculated or estimated

C6H7N+ + Benzene, bromo- = (C6H7N+ • Benzene, bromo-)

By formula: C6H7N+ + C6H5Br = (C6H7N+ • C6H5Br)

Bond type: Charge transfer bond (positive ion)

Quantity Value Units Method Reference Comment
Δr56.9kJ/molPHPMSMeot-Ner (Mautner) and El-Shall, 1986gas phase; Entropy change calculated or estimated
Quantity Value Units Method Reference Comment
Δr110.J/mol*KN/AMeot-Ner (Mautner) and El-Shall, 1986gas phase; Entropy change calculated or estimated

Free energy of reaction

ΔrG° (kJ/mol) T (K) Method Reference Comment
21.325.PHPMSMeot-Ner (Mautner) and El-Shall, 1986gas phase; Entropy change calculated or estimated

C6H7N+ + Benzene, chloro- = (C6H7N+ • Benzene, chloro-)

By formula: C6H7N+ + C6H5Cl = (C6H7N+ • C6H5Cl)

Bond type: Charge transfer bond (positive ion)

Quantity Value Units Method Reference Comment
Δr49.0kJ/molPHPMSMeot-Ner (Mautner) and El-Shall, 1986gas phase; Entropy change calculated or estimated
Quantity Value Units Method Reference Comment
Δr110.J/mol*KN/AMeot-Ner (Mautner) and El-Shall, 1986gas phase; Entropy change calculated or estimated

Free energy of reaction

ΔrG° (kJ/mol) T (K) Method Reference Comment
17.297.PHPMSMeot-Ner (Mautner) and El-Shall, 1986gas phase; Entropy change calculated or estimated

C6H7N+ + Benzene, fluoro- = (C6H7N+ • Benzene, fluoro-)

By formula: C6H7N+ + C6H5F = (C6H7N+ • C6H5F)

Bond type: Charge transfer bond (positive ion)

Quantity Value Units Method Reference Comment
Δr49.0kJ/molPHPMSMeot-Ner (Mautner) and El-Shall, 1986gas phase
Quantity Value Units Method Reference Comment
Δr111.J/mol*KPHPMSMeot-Ner (Mautner) and El-Shall, 1986gas phase

C6H7N+ + Benzene, iodo- = (C6H7N+ • Benzene, iodo-)

By formula: C6H7N+ + C6H5I = (C6H7N+ • C6H5I)

Bond type: Charge transfer bond (positive ion)

Quantity Value Units Method Reference Comment
Δr55.6kJ/molPHPMSMeot-Ner (Mautner) and El-Shall, 1986gas phase; Entropy change calculated or estimated
Quantity Value Units Method Reference Comment
Δr110.J/mol*KN/AMeot-Ner (Mautner) and El-Shall, 1986gas phase; Entropy change calculated or estimated

Free energy of reaction

ΔrG° (kJ/mol) T (K) Method Reference Comment
20.324.PHPMSMeot-Ner (Mautner) and El-Shall, 1986gas phase; Entropy change calculated or estimated

C6H7N+ + Benzene, nitro- = (C6H7N+ • Benzene, nitro-)

By formula: C6H7N+ + C6H5NO2 = (C6H7N+ • C6H5NO2)

Bond type: Charge transfer bond (positive ion)

Quantity Value Units Method Reference Comment
Δr74.1kJ/molPHPMSMeot-Ner (Mautner) and El-Shall, 1986gas phase
Quantity Value Units Method Reference Comment
Δr88.7J/mol*KPHPMSMeot-Ner (Mautner) and El-Shall, 1986gas phase

Free energy of reaction

ΔrG° (kJ/mol) T (K) Method Reference Comment
44.8324.PHPMSMeot-Ner (Mautner) and El-Shall, 1986gas phase

C6H7N+ + Benzene = (C6H7N+ • Benzene)

By formula: C6H7N+ + C6H6 = (C6H7N+ • C6H6)

Bond type: Charge transfer bond (positive ion)

Quantity Value Units Method Reference Comment
Δr49.8kJ/molPHPMSMeot-Ner (Mautner) and El-Shall, 1986gas phase
Quantity Value Units Method Reference Comment
Δr94.6J/mol*KPHPMSMeot-Ner (Mautner) and El-Shall, 1986gas phase

C6H7N+ + Aniline = (C6H7N+ • Aniline)

By formula: C6H7N+ + C6H7N = (C6H7N+ • C6H7N)

Bond type: Charge transfer bond (positive ion)

Quantity Value Units Method Reference Comment
Δr73.2kJ/molPHPMSMeot-Ner (Mautner) and El-Shall, 1986gas phase
Quantity Value Units Method Reference Comment
Δr103.J/mol*KPHPMSMeot-Ner (Mautner) and El-Shall, 1986gas phase

C6H7N+ + Benzene, (trifluoromethyl)- = (C6H7N+ • Benzene, (trifluoromethyl)-)

By formula: C6H7N+ + C7H5F3 = (C6H7N+ • C7H5F3)

Bond type: Charge transfer bond (positive ion)

Quantity Value Units Method Reference Comment
Δr49.4kJ/molPHPMSMeot-Ner (Mautner) and El-Shall, 1986gas phase; Entropy change calculated or estimated
Quantity Value Units Method Reference Comment
Δr110.J/mol*KN/AMeot-Ner (Mautner) and El-Shall, 1986gas phase; Entropy change calculated or estimated

Free energy of reaction

ΔrG° (kJ/mol) T (K) Method Reference Comment
17.300.PHPMSMeot-Ner (Mautner) and El-Shall, 1986gas phase; Entropy change calculated or estimated

C6H7N+ + Benzonitrile = (C6H7N+ • Benzonitrile)

By formula: C6H7N+ + C7H5N = (C6H7N+ • C7H5N)

Quantity Value Units Method Reference Comment
Δr81.2kJ/molPHPMSMeot-Ner (Mautner) and El-Shall, 1986gas phase; Entropy change calculated or estimated
Quantity Value Units Method Reference Comment
Δr88.J/mol*KN/AMeot-Ner (Mautner) and El-Shall, 1986gas phase; Entropy change calculated or estimated

Free energy of reaction

ΔrG° (kJ/mol) T (K) Method Reference Comment
51.5338.PHPMSMeot-Ner (Mautner) and El-Shall, 1986gas phase; Entropy change calculated or estimated

C6H7N+ + Toluene = (C6H7N+ • Toluene)

By formula: C6H7N+ + C7H8 = (C6H7N+ • C7H8)

Bond type: Charge transfer bond (positive ion)

Quantity Value Units Method Reference Comment
Δr57.3kJ/molPHPMSMeot-Ner (Mautner) and El-Shall, 1986gas phase
Quantity Value Units Method Reference Comment
Δr109.J/mol*KPHPMSMeot-Ner (Mautner) and El-Shall, 1986gas phase

C6H7N+ + p-Xylene = (C6H7N+ • p-Xylene)

By formula: C6H7N+ + C8H10 = (C6H7N+ • C8H10)

Bond type: Charge transfer bond (positive ion)

Quantity Value Units Method Reference Comment
Δr59.4kJ/molPHPMSMeot-Ner (Mautner) and El-Shall, 1986gas phase
Quantity Value Units Method Reference Comment
Δr110.J/mol*KPHPMSMeot-Ner (Mautner) and El-Shall, 1986gas phase

Free energy of reaction

ΔrG° (kJ/mol) T (K) Method Reference Comment
24.322.PHPMSMeot-Ner (Mautner) and El-Shall, 1986gas phase

C6H7N+ + Mesitylene = (C6H7N+ • Mesitylene)

By formula: C6H7N+ + C9H12 = (C6H7N+ • C9H12)

Bond type: Charge transfer bond (positive ion)

Quantity Value Units Method Reference Comment
Δr64.0kJ/molPHPMSMeot-Ner (Mautner) and El-Shall, 1986gas phase
Quantity Value Units Method Reference Comment
Δr107.J/mol*KPHPMSMeot-Ner (Mautner) and El-Shall, 1986gas phase

C6H7N+ + Naphthalene, 1-bromo- = (C6H7N+ • Naphthalene, 1-bromo-)

By formula: C6H7N+ + C10H7Br = (C6H7N+ • C10H7Br)

Bond type: Charge transfer bond (positive ion)

Quantity Value Units Method Reference Comment
Δr66.1kJ/molPHPMSEl-Shall and Meot-Ner (Mautner), 1987gas phase
Quantity Value Units Method Reference Comment
Δr123.J/mol*KPHPMSEl-Shall and Meot-Ner (Mautner), 1987gas phase

C6H7N+ + Naphthalene = (C6H7N+ • Naphthalene)

By formula: C6H7N+ + C10H8 = (C6H7N+ • C10H8)

Bond type: Charge transfer bond (positive ion)

Quantity Value Units Method Reference Comment
Δr64.4kJ/molPHPMSEl-Shall and Meot-Ner (Mautner), 1987gas phase; Entropy change calculated or estimated
Quantity Value Units Method Reference Comment
Δr110.J/mol*KN/AEl-Shall and Meot-Ner (Mautner), 1987gas phase; Entropy change calculated or estimated

Free energy of reaction

ΔrG° (kJ/mol) T (K) Method Reference Comment
31.324.PHPMSEl-Shall and Meot-Ner (Mautner), 1987gas phase; Entropy change calculated or estimated

C6H7N+ + Azulene = (C6H7N+ • Azulene)

By formula: C6H7N+ + C10H8 = (C6H7N+ • C10H8)

Bond type: Charge transfer bond (positive ion)

Quantity Value Units Method Reference Comment
Δr58.6kJ/molPHPMSMeot-Ner (Mautner) and El-Shall, 1986gas phase; Entropy change calculated or estimated
Quantity Value Units Method Reference Comment
Δr110.J/mol*KN/AMeot-Ner (Mautner) and El-Shall, 1986gas phase; Entropy change calculated or estimated

Free energy of reaction

ΔrG° (kJ/mol) T (K) Method Reference Comment
24.315.PHPMSMeot-Ner (Mautner) and El-Shall, 1986gas phase; Entropy change calculated or estimated

C6H7N+ + Benzene, n-butyl- = (C6H7N+ • Benzene, n-butyl-)

By formula: C6H7N+ + C10H14 = (C6H7N+ • C10H14)

Bond type: Charge transfer bond (positive ion)

Quantity Value Units Method Reference Comment
Δr58.2kJ/molPHPMSMeot-Ner (Mautner) and El-Shall, 1986gas phase; Entropy change calculated or estimated
Quantity Value Units Method Reference Comment
Δr110.J/mol*KN/AMeot-Ner (Mautner) and El-Shall, 1986gas phase; Entropy change calculated or estimated

Free energy of reaction

ΔrG° (kJ/mol) T (K) Method Reference Comment
22.330.PHPMSMeot-Ner (Mautner) and El-Shall, 1986gas phase; Entropy change calculated or estimated

C6H7N+ + Naphthalene, 1-methyl- = (C6H7N+ • Naphthalene, 1-methyl-)

By formula: C6H7N+ + C11H10 = (C6H7N+ • C11H10)

Bond type: Charge transfer bond (positive ion)

Quantity Value Units Method Reference Comment
Δr66.1kJ/molPHPMSEl-Shall and Meot-Ner (Mautner), 1987gas phase
Quantity Value Units Method Reference Comment
Δr105.J/mol*KPHPMSEl-Shall and Meot-Ner (Mautner), 1987gas phase

C6H7N+ + Acenaphthylene = (C6H7N+ • Acenaphthylene)

By formula: C6H7N+ + C12H8 = (C6H7N+ • C12H8)

Bond type: Charge transfer bond (positive ion)

Quantity Value Units Method Reference Comment
Δr72.0kJ/molPHPMSMeot-Ner (Mautner) and El-Shall, 1986gas phase; Entropy change calculated or estimated
Quantity Value Units Method Reference Comment
Δr110.J/mol*KN/AMeot-Ner (Mautner) and El-Shall, 1986gas phase; Entropy change calculated or estimated

Free energy of reaction

ΔrG° (kJ/mol) T (K) Method Reference Comment
36.325.PHPMSMeot-Ner (Mautner) and El-Shall, 1986gas phase; Entropy change calculated or estimated

C6H7N+ + Acenaphthene = (C6H7N+ • Acenaphthene)

By formula: C6H7N+ + C12H10 = (C6H7N+ • C12H10)

Bond type: Charge transfer bond (positive ion)

Quantity Value Units Method Reference Comment
Δr73.2kJ/molPHPMSMeot-Ner (Mautner) and El-Shall, 1986gas phase
Quantity Value Units Method Reference Comment
Δr115.J/mol*KPHPMSMeot-Ner (Mautner) and El-Shall, 1986gas phase

C6H7N+ + Benzene, hexamethyl- = (C6H7N+ • Benzene, hexamethyl-)

By formula: C6H7N+ + C12H18 = (C6H7N+ • C12H18)

Bond type: Charge transfer bond (positive ion)

Quantity Value Units Method Reference Comment
Δr71.5kJ/molPHPMSMeot-Ner (Mautner) and El-Shall, 1986gas phase
Quantity Value Units Method Reference Comment
Δr102.J/mol*KPHPMSMeot-Ner (Mautner) and El-Shall, 1986gas phase

Reaction thermochemistry data

Data compiled by: Michael M. Meot-Ner (Mautner) and Sharon G. Lias

Individual Reactions

C6H7N+ + Benzene, n-butyl- = (C6H7N+ • Benzene, n-butyl-)

By formula: C6H7N+ + C10H14 = (C6H7N+ • C10H14)

Bond type: Charge transfer bond (positive ion)

Quantity Value Units Method Reference Comment
Δr13.9kcal/molPHPMSMeot-Ner (Mautner) and El-Shall, 1986gas phase; Entropy change calculated or estimated
Quantity Value Units Method Reference Comment
Δr26.cal/mol*KN/AMeot-Ner (Mautner) and El-Shall, 1986gas phase; Entropy change calculated or estimated

Free energy of reaction

ΔrG° (kcal/mol) T (K) Method Reference Comment
5.3330.PHPMSMeot-Ner (Mautner) and El-Shall, 1986gas phase; Entropy change calculated or estimated

C6H7N+ + Benzene, bromo- = (C6H7N+ • Benzene, bromo-)

By formula: C6H7N+ + C6H5Br = (C6H7N+ • C6H5Br)

Bond type: Charge transfer bond (positive ion)

Quantity Value Units Method Reference Comment
Δr13.6kcal/molPHPMSMeot-Ner (Mautner) and El-Shall, 1986gas phase; Entropy change calculated or estimated
Quantity Value Units Method Reference Comment
Δr26.cal/mol*KN/AMeot-Ner (Mautner) and El-Shall, 1986gas phase; Entropy change calculated or estimated

Free energy of reaction

ΔrG° (kcal/mol) T (K) Method Reference Comment
5.1325.PHPMSMeot-Ner (Mautner) and El-Shall, 1986gas phase; Entropy change calculated or estimated

C6H7N+ + Benzene, chloro- = (C6H7N+ • Benzene, chloro-)

By formula: C6H7N+ + C6H5Cl = (C6H7N+ • C6H5Cl)

Bond type: Charge transfer bond (positive ion)

Quantity Value Units Method Reference Comment
Δr11.7kcal/molPHPMSMeot-Ner (Mautner) and El-Shall, 1986gas phase; Entropy change calculated or estimated
Quantity Value Units Method Reference Comment
Δr26.cal/mol*KN/AMeot-Ner (Mautner) and El-Shall, 1986gas phase; Entropy change calculated or estimated

Free energy of reaction

ΔrG° (kcal/mol) T (K) Method Reference Comment
4.0297.PHPMSMeot-Ner (Mautner) and El-Shall, 1986gas phase; Entropy change calculated or estimated

C6H7N+ + Acenaphthylene = (C6H7N+ • Acenaphthylene)

By formula: C6H7N+ + C12H8 = (C6H7N+ • C12H8)

Bond type: Charge transfer bond (positive ion)

Quantity Value Units Method Reference Comment
Δr17.2kcal/molPHPMSMeot-Ner (Mautner) and El-Shall, 1986gas phase; Entropy change calculated or estimated
Quantity Value Units Method Reference Comment
Δr26.cal/mol*KN/AMeot-Ner (Mautner) and El-Shall, 1986gas phase; Entropy change calculated or estimated

Free energy of reaction

ΔrG° (kcal/mol) T (K) Method Reference Comment
8.7325.PHPMSMeot-Ner (Mautner) and El-Shall, 1986gas phase; Entropy change calculated or estimated

C6H7N+ + Azulene = (C6H7N+ • Azulene)

By formula: C6H7N+ + C10H8 = (C6H7N+ • C10H8)

Bond type: Charge transfer bond (positive ion)

Quantity Value Units Method Reference Comment
Δr14.0kcal/molPHPMSMeot-Ner (Mautner) and El-Shall, 1986gas phase; Entropy change calculated or estimated
Quantity Value Units Method Reference Comment
Δr26.cal/mol*KN/AMeot-Ner (Mautner) and El-Shall, 1986gas phase; Entropy change calculated or estimated

Free energy of reaction

ΔrG° (kcal/mol) T (K) Method Reference Comment
5.8315.PHPMSMeot-Ner (Mautner) and El-Shall, 1986gas phase; Entropy change calculated or estimated

C6H7N+ + Benzene, iodo- = (C6H7N+ • Benzene, iodo-)

By formula: C6H7N+ + C6H5I = (C6H7N+ • C6H5I)

Bond type: Charge transfer bond (positive ion)

Quantity Value Units Method Reference Comment
Δr13.3kcal/molPHPMSMeot-Ner (Mautner) and El-Shall, 1986gas phase; Entropy change calculated or estimated
Quantity Value Units Method Reference Comment
Δr26.cal/mol*KN/AMeot-Ner (Mautner) and El-Shall, 1986gas phase; Entropy change calculated or estimated

Free energy of reaction

ΔrG° (kcal/mol) T (K) Method Reference Comment
4.8324.PHPMSMeot-Ner (Mautner) and El-Shall, 1986gas phase; Entropy change calculated or estimated

C6H7N+ + Naphthalene = (C6H7N+ • Naphthalene)

By formula: C6H7N+ + C10H8 = (C6H7N+ • C10H8)

Bond type: Charge transfer bond (positive ion)

Quantity Value Units Method Reference Comment
Δr15.4kcal/molPHPMSEl-Shall and Meot-Ner (Mautner), 1987gas phase; Entropy change calculated or estimated
Quantity Value Units Method Reference Comment
Δr26.cal/mol*KN/AEl-Shall and Meot-Ner (Mautner), 1987gas phase; Entropy change calculated or estimated

Free energy of reaction

ΔrG° (kcal/mol) T (K) Method Reference Comment
7.3324.PHPMSEl-Shall and Meot-Ner (Mautner), 1987gas phase; Entropy change calculated or estimated

C6H7N+ + Benzene, (trifluoromethyl)- = (C6H7N+ • Benzene, (trifluoromethyl)-)

By formula: C6H7N+ + C7H5F3 = (C6H7N+ • C7H5F3)

Bond type: Charge transfer bond (positive ion)

Quantity Value Units Method Reference Comment
Δr11.8kcal/molPHPMSMeot-Ner (Mautner) and El-Shall, 1986gas phase; Entropy change calculated or estimated
Quantity Value Units Method Reference Comment
Δr26.cal/mol*KN/AMeot-Ner (Mautner) and El-Shall, 1986gas phase; Entropy change calculated or estimated

Free energy of reaction

ΔrG° (kcal/mol) T (K) Method Reference Comment
4.0300.PHPMSMeot-Ner (Mautner) and El-Shall, 1986gas phase; Entropy change calculated or estimated

C6H7N+ + Benzene, hexafluoro- = (C6H7N+ • Benzene, hexafluoro-)

By formula: C6H7N+ + C6F6 = (C6H7N+ • C6F6)

Bond type: Charge transfer bond (positive ion)

Quantity Value Units Method Reference Comment
Δr11.3kcal/molPHPMSMeot-Ner (Mautner) and El-Shall, 1986gas phase; Entropy change calculated or estimated
Quantity Value Units Method Reference Comment
Δr26.cal/mol*KN/AMeot-Ner (Mautner) and El-Shall, 1986gas phase; Entropy change calculated or estimated
Quantity Value Units Method Reference Comment
Δr3.5kcal/molPHPMSMeot-Ner (Mautner) and El-Shall, 1986gas phase; Entropy change calculated or estimated

C6H7N+ + Benzonitrile = (C6H7N+ • Benzonitrile)

By formula: C6H7N+ + C7H5N = (C6H7N+ • C7H5N)

Quantity Value Units Method Reference Comment
Δr19.4kcal/molPHPMSMeot-Ner (Mautner) and El-Shall, 1986gas phase; Entropy change calculated or estimated
Quantity Value Units Method Reference Comment
Δr21.cal/mol*KN/AMeot-Ner (Mautner) and El-Shall, 1986gas phase; Entropy change calculated or estimated

Free energy of reaction

ΔrG° (kcal/mol) T (K) Method Reference Comment
12.3338.PHPMSMeot-Ner (Mautner) and El-Shall, 1986gas phase; Entropy change calculated or estimated

C6H7N+ + Methane, nitro- = (C6H7N+ • Methane, nitro-)

By formula: C6H7N+ + CH3NO2 = (C6H7N+ • CH3NO2)

Quantity Value Units Method Reference Comment
Δr14.4kcal/molPHPMSMeot-Ner (Mautner) and El-Shall, 1986gas phase; Entropy change calculated or estimated
Quantity Value Units Method Reference Comment
Δr18.cal/mol*KN/AMeot-Ner (Mautner) and El-Shall, 1986gas phase; Entropy change calculated or estimated

Free energy of reaction

ΔrG° (kcal/mol) T (K) Method Reference Comment
8.2343.PHPMSMeot-Ner (Mautner) and El-Shall, 1986gas phase; Entropy change calculated or estimated

C6H7N+ + Methane, iodo- = (C6H7N+ • Methane, iodo-)

By formula: C6H7N+ + CH3I = (C6H7N+ • CH3I)

Quantity Value Units Method Reference Comment
Δr9.7kcal/molPHPMSMeot-Ner (Mautner) and El-Shall, 1986gas phase; Entropy change calculated or estimated
Quantity Value Units Method Reference Comment
Δr18.cal/mol*KN/AMeot-Ner (Mautner) and El-Shall, 1986gas phase; Entropy change calculated or estimated

Free energy of reaction

ΔrG° (kcal/mol) T (K) Method Reference Comment
4.3299.PHPMSMeot-Ner (Mautner) and El-Shall, 1986gas phase; Entropy change calculated or estimated

C6H7N+ + Benzene, nitro- = (C6H7N+ • Benzene, nitro-)

By formula: C6H7N+ + C6H5NO2 = (C6H7N+ • C6H5NO2)

Bond type: Charge transfer bond (positive ion)

Quantity Value Units Method Reference Comment
Δr17.7kcal/molPHPMSMeot-Ner (Mautner) and El-Shall, 1986gas phase
Quantity Value Units Method Reference Comment
Δr21.2cal/mol*KPHPMSMeot-Ner (Mautner) and El-Shall, 1986gas phase

Free energy of reaction

ΔrG° (kcal/mol) T (K) Method Reference Comment
10.7324.PHPMSMeot-Ner (Mautner) and El-Shall, 1986gas phase

C6H7N+ + p-Xylene = (C6H7N+ • p-Xylene)

By formula: C6H7N+ + C8H10 = (C6H7N+ • C8H10)

Bond type: Charge transfer bond (positive ion)

Quantity Value Units Method Reference Comment
Δr14.2kcal/molPHPMSMeot-Ner (Mautner) and El-Shall, 1986gas phase
Quantity Value Units Method Reference Comment
Δr26.cal/mol*KPHPMSMeot-Ner (Mautner) and El-Shall, 1986gas phase

Free energy of reaction

ΔrG° (kcal/mol) T (K) Method Reference Comment
5.8322.PHPMSMeot-Ner (Mautner) and El-Shall, 1986gas phase

C6H7N+ + Mesitylene = (C6H7N+ • Mesitylene)

By formula: C6H7N+ + C9H12 = (C6H7N+ • C9H12)

Bond type: Charge transfer bond (positive ion)

Quantity Value Units Method Reference Comment
Δr15.3kcal/molPHPMSMeot-Ner (Mautner) and El-Shall, 1986gas phase
Quantity Value Units Method Reference Comment
Δr25.6cal/mol*KPHPMSMeot-Ner (Mautner) and El-Shall, 1986gas phase

C6H7N+ + Toluene = (C6H7N+ • Toluene)

By formula: C6H7N+ + C7H8 = (C6H7N+ • C7H8)

Bond type: Charge transfer bond (positive ion)

Quantity Value Units Method Reference Comment
Δr13.7kcal/molPHPMSMeot-Ner (Mautner) and El-Shall, 1986gas phase
Quantity Value Units Method Reference Comment
Δr26.0cal/mol*KPHPMSMeot-Ner (Mautner) and El-Shall, 1986gas phase

C6H7N+ + Benzene, fluoro- = (C6H7N+ • Benzene, fluoro-)

By formula: C6H7N+ + C6H5F = (C6H7N+ • C6H5F)

Bond type: Charge transfer bond (positive ion)

Quantity Value Units Method Reference Comment
Δr11.7kcal/molPHPMSMeot-Ner (Mautner) and El-Shall, 1986gas phase
Quantity Value Units Method Reference Comment
Δr26.5cal/mol*KPHPMSMeot-Ner (Mautner) and El-Shall, 1986gas phase

C6H7N+ + Aniline = (C6H7N+ • Aniline)

By formula: C6H7N+ + C6H7N = (C6H7N+ • C6H7N)

Bond type: Charge transfer bond (positive ion)

Quantity Value Units Method Reference Comment
Δr17.5kcal/molPHPMSMeot-Ner (Mautner) and El-Shall, 1986gas phase
Quantity Value Units Method Reference Comment
Δr24.6cal/mol*KPHPMSMeot-Ner (Mautner) and El-Shall, 1986gas phase

C6H7N+ + Benzene = (C6H7N+ • Benzene)

By formula: C6H7N+ + C6H6 = (C6H7N+ • C6H6)

Bond type: Charge transfer bond (positive ion)

Quantity Value Units Method Reference Comment
Δr11.9kcal/molPHPMSMeot-Ner (Mautner) and El-Shall, 1986gas phase
Quantity Value Units Method Reference Comment
Δr22.6cal/mol*KPHPMSMeot-Ner (Mautner) and El-Shall, 1986gas phase

C6H7N+ + Acenaphthene = (C6H7N+ • Acenaphthene)

By formula: C6H7N+ + C12H10 = (C6H7N+ • C12H10)

Bond type: Charge transfer bond (positive ion)

Quantity Value Units Method Reference Comment
Δr17.5kcal/molPHPMSMeot-Ner (Mautner) and El-Shall, 1986gas phase
Quantity Value Units Method Reference Comment
Δr27.6cal/mol*KPHPMSMeot-Ner (Mautner) and El-Shall, 1986gas phase

C6H7N+ + Benzene, hexamethyl- = (C6H7N+ • Benzene, hexamethyl-)

By formula: C6H7N+ + C12H18 = (C6H7N+ • C12H18)

Bond type: Charge transfer bond (positive ion)

Quantity Value Units Method Reference Comment
Δr17.1kcal/molPHPMSMeot-Ner (Mautner) and El-Shall, 1986gas phase
Quantity Value Units Method Reference Comment
Δr24.3cal/mol*KPHPMSMeot-Ner (Mautner) and El-Shall, 1986gas phase

C6H7N+ + Naphthalene, 1-bromo- = (C6H7N+ • Naphthalene, 1-bromo-)

By formula: C6H7N+ + C10H7Br = (C6H7N+ • C10H7Br)

Bond type: Charge transfer bond (positive ion)

Quantity Value Units Method Reference Comment
Δr15.8kcal/molPHPMSEl-Shall and Meot-Ner (Mautner), 1987gas phase
Quantity Value Units Method Reference Comment
Δr29.3cal/mol*KPHPMSEl-Shall and Meot-Ner (Mautner), 1987gas phase

C6H7N+ + Naphthalene, 1-methyl- = (C6H7N+ • Naphthalene, 1-methyl-)

By formula: C6H7N+ + C11H10 = (C6H7N+ • C11H10)

Bond type: Charge transfer bond (positive ion)

Quantity Value Units Method Reference Comment
Δr15.8kcal/molPHPMSEl-Shall and Meot-Ner (Mautner), 1987gas phase
Quantity Value Units Method Reference Comment
Δr25.1cal/mol*KPHPMSEl-Shall and Meot-Ner (Mautner), 1987gas phase

C6H7N+ + Acetonitrile = (C6H7N+ • Acetonitrile)

By formula: C6H7N+ + C2H3N = (C6H7N+ • C2H3N)

Quantity Value Units Method Reference Comment
Δr17.3kcal/molPHPMSMeot-Ner (Mautner) and El-Shall, 1986gas phase
Quantity Value Units Method Reference Comment
Δr17.8cal/mol*KPHPMSMeot-Ner (Mautner) and El-Shall, 1986gas phase

References

Meot-Ner (Mautner) and El-Shall, 1986
Meot-Ner (Mautner), M.; El-Shall, M.S., Ionic Charge Transfer Complexes. 1. Cationic Complexes with Delocalized and Partially Localized pi Systems, J. Am. Chem. Soc., 1986, 108, 15, 4386, https://doi.org/10.1021/ja00275a026 . [all data]

El-Shall and Meot-Ner (Mautner), 1987
El-Shall, M.S.; Meot-Ner (Mautner), M., Ionic Charge Transfer Complexes. 3. Delocalised pi Systems as Electron Acceptors and Donors, J. Phys. Chem., 1987, 91, 5, 1088, https://doi.org/10.1021/j100289a017 . [all data]