1H,1H,17H-Dotriacontafluoro-1-heptadecanol

Kovats' RI, non-polar column, isothermal

View large format table.

Column type Active phase Temperature (C) I Reference Comment
CapillaryPermaphase DMS160.1410.Boneva and Kotov, 199250. m/0.25 mm/1.0 μm
CapillaryPermaphase DMS170.1384.Boneva and Kotov, 199250. m/0.25 mm/1.0 μm
CapillaryPermaphase DMS180.1384.Boneva and Kotov, 199250. m/0.25 mm/1.0 μm

References

Boneva and Kotov, 1992
Boneva, S.; Kotov, St., Capillary gas chromatography of some telomeric fluoroalkanols, Chromatographia, 1992, 34, 9/10, 475-478, https://doi.org/10.1007/BF02290239 . [all data]