Bakerol

Normal alkane RI, non-polar column, temperature ramp

View large format table.

Column type Active phase I Reference Comment
CapillaryOptima-51448.Al-Qudah, Muhaidat, et al., 201230. m/0.25 mm/0.25 μm, Helium, 60. C @ 1. min, 3. K/min; Tend: 246. C

References

Al-Qudah, Muhaidat, et al., 2012
Al-Qudah, M.A.; Muhaidat, R.; Trawenh, I.N.; Jaber, H.I.; Abu Zarga, M.H.; Abu Orabi, S.T., Volatile constituents of leaves and bulbs of Gynandriris Sisyrinchicum and their antimicrobial activities, Jordan J. Chem., 2012, 7, 3, 287-295. [all data]