Terfenadine M (-2H2O)

Kovats' RI, non-polar column, temperature ramp

View large format table.

Column type Active phase I Reference Comment
CapillaryMethyl Silicone3460.Maurer and Pfleger, 198812. m/0.20 mm/0.33 μm, He, 100. C @ 3. min, 30. K/min, 310. C @ 5. min

References

Maurer and Pfleger, 1988
Maurer, H.; Pfleger, K., Identification and Differentiation of Alkylamine Antihistamines and Their Metabolites in Urine by Computerized Gas Chromatography-Mass Spectrometry, J. Chromatogr., 1988, 430, 31-41, https://doi.org/10.1016/S0378-4347(00)83131-X . [all data]