potassium hydrogendifluoride

Condensed phase thermochemistry data

Quantity Value Units Method Reference Comment
Δfliquid-916.57kJ/molReviewChase, 1998Data last reviewed in June, 1971
Quantity Value Units Method Reference Comment
liquid,1 bar132.77J/mol*KReviewChase, 1998Data last reviewed in June, 1971
Quantity Value Units Method Reference Comment
Δfsolid-931.23kJ/molReviewChase, 1998Data last reviewed in June, 1971
Quantity Value Units Method Reference Comment
solid104.26J/mol*KReviewChase, 1998Data last reviewed in June, 1971

Liquid Phase Heat Capacity (Shomate Equation)

Cp° = A + B*t + C*t2 + D*t3 + E/t2
H° − H°298.15= A*t + B*t2/2 + C*t3/3 + D*t4/4 − E/t + F − H
S° = A*ln(t) + B*t + C*t2/2 + D*t3/3 − E/(2*t2) + G
    Cp = heat capacity (J/mol*K)
    H° = standard enthalpy (kJ/mol)
    S° = standard entropy (J/mol*K)
    t = temperature (K) / 1000.

View plot Requires a JavaScript / HTML 5 canvas capable browser.

View table.

Temperature (K) 511.95 - 2000.
A 104.6000
B 1.197391×10-12
C 0.000000
D 0.000000
E 3.270202×10-13
F -948.1864
G 257.9495
H -916.5721
ReferenceChase, 1998
Comment Data last reviewed in June, 1971

Solid Phase Heat Capacity (Shomate Equation)

Cp° = A + B*t + C*t2 + D*t3 + E/t2
H° − H°298.15= A*t + B*t2/2 + C*t3/3 + D*t4/4 − E/t + F − H
S° = A*ln(t) + B*t + C*t2/2 + D*t3/3 − E/(2*t2) + G
    Cp = heat capacity (J/mol*K)
    H° = standard enthalpy (kJ/mol)
    S° = standard entropy (J/mol*K)
    t = temperature (K) / 1000.

View plot Requires a JavaScript / HTML 5 canvas capable browser.

View table.

Temperature (K) 298. - 469.469. - 511.95
A 17.83648100.2491
B 301.1493-2.149882×10-8
C -498.38551.475985×10-8
D 404.7530-3.352494×10-9
E 0.257073-8.282019×10-10
F -945.4710-952.5796
G 56.08275242.1076
H -931.2329-931.2329
ReferenceChase, 1998Chase, 1998
Comment Data last reviewed in June, 1971 Data last reviewed in June, 1971

References

Chase, 1998
Chase, M.W., Jr., NIST-JANAF Themochemical Tables, Fourth Edition, J. Phys. Chem. Ref. Data, Monograph 9, 1998, 1-1951. [all data]