iron sulphate

Condensed phase thermochemistry data

Quantity Value Units Method Reference Comment
Δfsolid-928.85kJ/molReviewChase, 1998Data last reviewed in June, 1966
Quantity Value Units Method Reference Comment
solid120.93J/mol*KReviewChase, 1998Data last reviewed in June, 1966

Solid Phase Heat Capacity (Shomate Equation)

Cp° = A + B*t + C*t2 + D*t3 + E/t2
H° − H°298.15= A*t + B*t2/2 + C*t3/3 + D*t4/4 − E/t + F − H
S° = A*ln(t) + B*t + C*t2/2 + D*t3/3 − E/(2*t2) + G
    Cp = heat capacity (J/mol*K)
    H° = standard enthalpy (kJ/mol)
    S° = standard entropy (J/mol*K)
    t = temperature (K) / 1000.

View plot Requires a JavaScript / HTML 5 canvas capable browser.

View table.

Temperature (K) 298. - 1200.1200. - 2000.
A 32.55964156.9548
B 305.48933.795713
C -264.41003.459361
D 81.95661-0.545610
E -0.150805-8.233778
F -950.4793-1000.792
G 79.43198270.6282
H -928.8480-928.8480
ReferenceChase, 1998Chase, 1998
Comment Data last reviewed in June, 1966 Data last reviewed in June, 1966

References

Chase, 1998
Chase, M.W., Jr., NIST-JANAF Themochemical Tables, Fourth Edition, J. Phys. Chem. Ref. Data, Monograph 9, 1998, 1-1951. [all data]