titanium dihydride

Condensed phase thermochemistry data

Quantity Value Units Method Reference Comment
Δfsolid-144.35kJ/molReviewChase, 1998Data last reviewed in June, 1963
Quantity Value Units Method Reference Comment
solid29.70J/mol*KReviewChase, 1998Data last reviewed in June, 1963

Solid Phase Heat Capacity (Shomate Equation)

Cp° = A + B*t + C*t2 + D*t3 + E/t2
H° − H°298.15= A*t + B*t2/2 + C*t3/3 + D*t4/4 − E/t + F − H
S° = A*ln(t) + B*t + C*t2/2 + D*t3/3 − E/(2*t2) + G
    Cp = heat capacity (J/mol*K)
    H° = standard enthalpy (kJ/mol)
    S° = standard entropy (J/mol*K)
    t = temperature (K) / 1000.

View plot Requires a JavaScript / HTML 5 canvas capable browser.

View table.

Temperature (K) 298. - 1000.1000. - 2000.
A -18.62650117.8740
B 190.9860-60.43550
C -142.447033.68230
D 38.31300-6.548070
E 0.303605-16.17650
F -145.0850-219.8510
G -42.08210127.9850
H -144.3480-144.3480
ReferenceChase, 1998Chase, 1998
Comment Data last reviewed in June, 1963 Data last reviewed in June, 1963

References

Chase, 1998
Chase, M.W., Jr., NIST-JANAF Themochemical Tables, Fourth Edition, J. Phys. Chem. Ref. Data, Monograph 9, 1998, 1-1951. [all data]