2,3,6,7,10,11-hexakis[[(2R,4R,6R)-2,4,6-trimethyloctyl]oxy]-triphenylene

Phase change data

Data compiled by: William E. Acree, Jr., James S. Chickos

Enthalpy of fusion

ΔfusH (kJ/mol) Temperature (K) Reference
5.2237.2Schultz, Laschat, et al., 2002

References

Schultz, Laschat, et al., 2002
Schultz, Andreas; Laschat, Sabine; Morr, Michael; Diele, Siegmar; Dreyer, Michael; Bringmann, Gerhard, Highly Branched Alkanoic Acids from the Preen-Gland Wax of the Domestic Goose as Building Blocks for Chiral Triphenylenes, HCA, 2002, 85, 11, 3909-3918, https://doi.org/10.1002/1522-2675(200211)85:11<3909::AID-HLCA3909>3.0.CO;2-R . [all data]